[CmakeList] update minimum Pinocchio version to 2.2.0

20 jobs for topic/task-am in 33 minutes and 42 seconds (queued for 3 seconds)
latest
Status Name Job ID Coverage
  Test
passed doc-coverage #64767

00:33:38

failed format #64768
allowed to fail

00:05:37

passed robotpkg-py-tsid-16.04-debug #64750

00:22:14

passed robotpkg-py-tsid-16.04-release #64749

00:20:20

passed robotpkg-py-tsid-18.04-debug #64754

00:29:44

passed robotpkg-py-tsid-18.04-release #64753

00:26:53

failed robotpkg-py-tsid-py3-16.04-debug #64752
allowed to fail

00:05:32

failed robotpkg-py-tsid-py3-16.04-release #64751
allowed to fail

00:00:30

failed robotpkg-py-tsid-py3-18.04-debug #64756
allowed to fail

00:05:38

failed robotpkg-py-tsid-py3-18.04-release #64755
allowed to fail

00:00:31

failed robotpkg-py-tsid-py3-stretch-debug #64760
allowed to fail

00:00:31

failed robotpkg-py-tsid-py3-stretch-release #64759
allowed to fail

00:05:36

passed robotpkg-py-tsid-stretch-debug #64758

00:30:28

passed robotpkg-py-tsid-stretch-release #64757

00:09:47

passed robotpkg-tsid-16.04-debug #64761

00:13:25

passed robotpkg-tsid-16.04-release #64762

00:11:29

passed robotpkg-tsid-18.04-debug #64764

00:16:45

passed robotpkg-tsid-18.04-release #64763

00:14:34

passed robotpkg-tsid-stretch-debug #64766

00:16:45

passed robotpkg-tsid-stretch-release #64765

00:14:53

 
Name Stage Failure
failed
format Test
   getProfiler().report_all(3, cout);
getStatistics().report_all(1, cout);
}

-
-
-BOOST_AUTO_TEST_SUITE_END ()
+BOOST_AUTO_TEST_SUITE_END()
ERROR: Job failed: exit code 1
failed
robotpkg-py-tsid-py3-18.04-debug Test
For details or bug reports, check the complete log file in:
/root/robotpkg/wip/tsid/work.runner-7gqkM7SY-project-596-concurrent-5/configure.log
make[1]: *** [do-configure-cmake] Error 1
/root/robotpkg/mk/configure/cmake-configure.mk:100: recipe for target 'do-configure-cmake' failed
/root/robotpkg/mk/depends/depends.mk:70: recipe for target 'do-depends' failed
make: *** [do-depends] Error 1
make: *** [install] Error 2
/root/robotpkg/mk/internal/trusted.mk:36: recipe for target 'install' failed
ERROR: Job failed: exit code 1
failed
robotpkg-py-tsid-py3-stretch-release Test
For details or bug reports, check the complete log file in:
/root/robotpkg/wip/tsid/work.runner-7gqkM7SY-project-596-concurrent-7/configure.log
make[1]: *** [do-configure-cmake] Error 1
/root/robotpkg/mk/configure/cmake-configure.mk:100: recipe for target 'do-configure-cmake' failed
make: *** [do-depends] Error 1
/root/robotpkg/mk/depends/depends.mk:70: recipe for target 'do-depends' failed
make: *** [install] Error 2
/root/robotpkg/mk/internal/trusted.mk:36: recipe for target 'install' failed
ERROR: Job failed: exit code 1
failed
robotpkg-py-tsid-py3-16.04-debug Test
/root/robotpkg/wip/tsid/work.runner-7gqkM7SY-project-596-concurrent-2/configure.log

/root/robotpkg/mk/configure/cmake-configure.mk:100: recipe for target 'do-configure-cmake' failed
make[1]: *** [do-configure-cmake] Error 1
make: *** [do-depends] Error 1
/root/robotpkg/mk/depends/depends.mk:70: recipe for target 'do-depends' failed
make: *** [install] Error 2
/root/robotpkg/mk/internal/trusted.mk:36: recipe for target 'install' failed
ERROR: Job failed: exit code 1
failed
robotpkg-py-tsid-py3-stretch-debug Test
/root/robotpkg/wip/tsid/work.runner-sWwLEjyc-project-596-concurrent-3/configure.log

make[1]: *** [do-configure-cmake] Error 1
/root/robotpkg/mk/configure/cmake-configure.mk:100: recipe for target 'do-configure-cmake' failed
/root/robotpkg/mk/depends/depends.mk:70: recipe for target 'do-depends' failed
make: *** [do-depends] Error 1
make: *** [install] Error 2
/root/robotpkg/mk/internal/trusted.mk:36: recipe for target 'install' failed
ERROR: Job failed: exit code 1
failed
robotpkg-py-tsid-py3-18.04-release Test
/root/robotpkg/wip/tsid/work.runner-sWwLEjyc-project-596-concurrent-1/configure.log

/root/robotpkg/mk/configure/cmake-configure.mk:100: recipe for target 'do-configure-cmake' failed
make[1]: *** [do-configure-cmake] Error 1
make: *** [do-depends] Error 1
/root/robotpkg/mk/depends/depends.mk:70: recipe for target 'do-depends' failed
make: *** [install] Error 2
/root/robotpkg/mk/internal/trusted.mk:36: recipe for target 'install' failed
ERROR: Job failed: exit code 1
failed
robotpkg-py-tsid-py3-16.04-release Test
For details or bug reports, check the complete log file in:
/root/robotpkg/wip/tsid/work.runner-sWwLEjyc-project-596-concurrent-0/configure.log
/root/robotpkg/mk/configure/cmake-configure.mk:100: recipe for target 'do-configure-cmake' failed
make[1]: *** [do-configure-cmake] Error 1
make: *** [do-depends] Error 1
/root/robotpkg/mk/depends/depends.mk:70: recipe for target 'do-depends' failed
make: *** [install] Error 2
/root/robotpkg/mk/internal/trusted.mk:36: recipe for target 'install' failed
ERROR: Job failed: exit code 1