bezier 4 with bezier 3 does not make sense

9 jobs for pr_52 in 3 minutes and 39 seconds (queued for 2 seconds)
Status Name Job ID Coverage
  Test
failed doc-coverage #107736

00:02:20

failed format #107737
allowed to fail

00:00:08

failed robotpkg-curves-18.04-release #107729

00:02:07

failed robotpkg-py-curves-py2-18.04-release #107732

00:03:39

failed robotpkg-py-curves-py3-16.04-release #107730
allowed to fail

00:00:37

failed robotpkg-py-curves-py3-18.04-release #107731

00:03:38

failed robotpkg-py-curves-py3-20.04-release #107733

00:01:02

failed robotpkg-py-curves-py3-buster-release #107734
allowed to fail

00:02:14

failed robotpkg-py-curves-py3-stretch-release #107735
allowed to fail

00:01:44

 
Name Stage Failure
failed
robotpkg-py-curves-py3-18.04-release Test
ERROR: missing:	/opt/openrobots/include/curves/config.hh
ERROR:
ERROR: Please reinstall the package in ../../math/curves
ERROR: ======================================================================
make: *** [do-depends] Error 1
/root/robotpkg/mk/depends/depends.mk:70: recipe for target 'do-depends' failed
/root/robotpkg/mk/internal/trusted.mk:36: recipe for target 'install' failed
make: *** [install] Error 2
ERROR: Job failed: exit code 1
failed
robotpkg-py-curves-py3-20.04-release Test
ERROR: found:	/opt/openrobots/include/curves/config.hh, wrong version 0.2.0
ERROR: missing: /opt/openrobots/include/curves/config.hh
ERROR:
ERROR: Please reinstall the package in ../../math/curves
ERROR: ======================================================================
make: *** [/root/robotpkg/mk/depends/depends.mk:70: do-depends] Error 1
make: *** [/root/robotpkg/mk/internal/trusted.mk:36: install] Error 2
Cleaning up file based variables
ERROR: Job failed: exit code 1
failed
doc-coverage Test
make: *** [install] Error 2
Running after_script
Running after script...
$ cd /root/robotpkg/math/py-curves
$ build=$(make show-var VARNAME=CONFIGURE_DIRS); cd $(make show-var VARNAME=WRKSRC); cd $build
$ make doc
make: *** No rule to make target 'doc'. Stop.
Cleaning up file based variables
ERROR: Job failed: exit code 1
failed
robotpkg-py-curves-py3-stretch-release Test
ERROR: 
ERROR: Please reinstall the package in ../../math/curves
ERROR: ======================================================================
make: *** [do-depends] Error 1
/root/robotpkg/mk/depends/depends.mk:70: recipe for target 'do-depends' failed
make: *** [install] Error 2
/root/robotpkg/mk/internal/trusted.mk:36: recipe for target 'install' failed
Cleaning up file based variables
ERROR: Job failed: exit code 1
failed
robotpkg-py-curves-py3-16.04-release Test
ERROR: 
ERROR: Please reinstall the package in ../../math/curves
ERROR: ======================================================================
make: *** [do-depends] Error 1
/root/robotpkg/mk/depends/depends.mk:70: recipe for target 'do-depends' failed
make: *** [install] Error 2
/root/robotpkg/mk/internal/trusted.mk:36: recipe for target 'install' failed
Cleaning up file based variables
ERROR: Job failed: exit code 1
failed
robotpkg-curves-18.04-release Test
Total Test time (real) =   0.85 sec

The following tests FAILED:
1 - curves_tests (Child aborted)
Errors while running CTest
make: *** [test] Error 8
Makefile:109: recipe for target 'test' failed
Cleaning up file based variables
ERROR: Job failed: exit code 1
failed
robotpkg-py-curves-py2-18.04-release Test
ERROR: missing:	/opt/openrobots/include/curves/config.hh
ERROR:
ERROR: Please reinstall the package in ../../math/curves
ERROR: ======================================================================
make: *** [do-depends] Error 1
/root/robotpkg/mk/depends/depends.mk:70: recipe for target 'do-depends' failed
make: *** [install] Error 2
/root/robotpkg/mk/internal/trusted.mk:36: recipe for target 'install' failed
ERROR: Job failed: exit code 1
failed
robotpkg-py-curves-py3-buster-release Test
ERROR: found:	/opt/openrobots/include/curves/config.hh, wrong version 0.2.0
ERROR: missing: /opt/openrobots/include/curves/config.hh
ERROR:
ERROR: Please reinstall the package in ../../math/curves
ERROR: ======================================================================
make: *** [/root/robotpkg/mk/depends/depends.mk:70: do-depends] Error 1
make: *** [/root/robotpkg/mk/internal/trusted.mk:36: install] Error 2
Cleaning up file based variables
ERROR: Job failed: exit code 1
failed
format Test
 }

+} // namespace optimization
+} // namespace curves

-#endif //_CLASS_LOAD_TEST_PROBLEMS
+#endif //_CLASS_LOAD_TEST_PROBLEMS
Cleaning up file based variables
ERROR: Job failed: exit code 1