bezier 4 with bezier 3 does not make sense

9 jobs for topic/arithmetic_operations in 2 minutes and 31 seconds (queued for 1 second)
latest
Status Job ID Name Coverage
  Test
failed #107300
doc-coverage

00:00:54

failed #107301
allowed to fail
format

00:00:49

failed #107293
robotpkg-curves-18.04-release

00:01:59

failed #107296
robotpkg-py-curves-py2-18.04-release

00:02:21

failed #107294
allowed to fail
robotpkg-py-curves-py3-16.04-release

00:02:15

failed #107295
robotpkg-py-curves-py3-18.04-release

00:02:00

failed #107297
robotpkg-py-curves-py3-20.04-release

00:00:50

failed #107298
allowed to fail
robotpkg-py-curves-py3-buster-release

00:00:43

failed #107299
allowed to fail
robotpkg-py-curves-py3-stretch-release

00:02:29

 
Name Stage Failure
failed
robotpkg-py-curves-py3-stretch-release Test
ERROR: missing:	/opt/openrobots/include/curves/config.hh
ERROR:
ERROR: Please reinstall the package in ../../math/curves
ERROR: ======================================================================
/root/robotpkg/mk/depends/depends.mk:70: recipe for target 'do-depends' failed
make: *** [do-depends] Error 1
/root/robotpkg/mk/internal/trusted.mk:36: recipe for target 'install' failed
make: *** [install] Error 2
ERROR: Job failed: exit code 1
failed
robotpkg-py-curves-py2-18.04-release Test
ERROR: missing:	/opt/openrobots/include/curves/config.hh
ERROR:
ERROR: Please reinstall the package in ../../math/curves
ERROR: ======================================================================
make: *** [do-depends] Error 1
/root/robotpkg/mk/depends/depends.mk:70: recipe for target 'do-depends' failed
make: *** [install] Error 2
/root/robotpkg/mk/internal/trusted.mk:36: recipe for target 'install' failed
ERROR: Job failed: exit code 1
failed
robotpkg-py-curves-py3-16.04-release Test
ERROR: missing:	/opt/openrobots/include/curves/config.hh
ERROR:
ERROR: Please reinstall the package in ../../math/curves
ERROR: ======================================================================
/root/robotpkg/mk/depends/depends.mk:70: recipe for target 'do-depends' failed
make: *** [do-depends] Error 1
/root/robotpkg/mk/internal/trusted.mk:36: recipe for target 'install' failed
make: *** [install] Error 2
ERROR: Job failed: exit code 1
failed
robotpkg-py-curves-py3-18.04-release Test
ERROR: missing:	/opt/openrobots/include/curves/config.hh
ERROR:
ERROR: Please reinstall the package in ../../math/curves
ERROR: ======================================================================
make: *** [do-depends] Error 1
/root/robotpkg/mk/depends/depends.mk:70: recipe for target 'do-depends' failed
make: *** [install] Error 2
/root/robotpkg/mk/internal/trusted.mk:36: recipe for target 'install' failed
ERROR: Job failed: exit code 1
failed
robotpkg-curves-18.04-release Test

Total Test time (real) = 0.79 sec

The following tests FAILED:
1 - curves_tests (Child aborted)
Errors while running CTest
Makefile:109: recipe for target 'test' failed
make: *** [test] Error 8
ERROR: Job failed: exit code 1
failed
doc-coverage Test
make: *** [install] Error 2
Running after_script
Running after script...
$ cd /root/robotpkg/math/py-curves
$ build=$(make show-var VARNAME=CONFIGURE_DIRS); cd $(make show-var VARNAME=WRKSRC); cd $build
$ make doc
make: *** No rule to make target 'doc'. Stop.
Cleaning up file based variables
ERROR: Job failed: exit code 1
failed
robotpkg-py-curves-py3-20.04-release Test
ERROR: found:	/opt/openrobots/include/curves/config.hh, wrong version 0.2.0
ERROR: missing: /opt/openrobots/include/curves/config.hh
ERROR:
ERROR: Please reinstall the package in ../../math/curves
ERROR: ======================================================================
make: *** [/root/robotpkg/mk/depends/depends.mk:70: do-depends] Error 1
make: *** [/root/robotpkg/mk/internal/trusted.mk:36: install] Error 2
Cleaning up file based variables
ERROR: Job failed: exit code 1
failed
format Test
+  // TODO curve constraints
}

+} // namespace optimization
+} // namespace curves

-#endif //_CLASS_LOAD_TEST_PROBLEMS
+#endif //_CLASS_LOAD_TEST_PROBLEMS
ERROR: Job failed: exit code 1
failed
robotpkg-py-curves-py3-buster-release Test
ERROR: found:	/opt/openrobots/include/curves/config.hh, wrong version 0.2.0
ERROR: missing: /opt/openrobots/include/curves/config.hh
ERROR:
ERROR: Please reinstall the package in ../../math/curves
ERROR: ======================================================================
make: *** [/root/robotpkg/mk/depends/depends.mk:70: do-depends] Error 1
make: *** [/root/robotpkg/mk/internal/trusted.mk:36: install] Error 2
Cleaning up file based variables
ERROR: Job failed: exit code 1