[CMake] add INSTALL_PYTHON_INTERFACE_ONLY option

10 jobs for v0.3.1 in 3 minutes and 57 seconds (queued for 3 seconds)
latest
Status Job ID Name Coverage
  Test
failed #93829
doc-coverage

00:01:50

passed #93830
format

00:00:18

passed #93822
robotpkg-curves-18.04-release

00:01:49

failed #93825
robotpkg-py-curves-py2-18.04-release

00:01:29

canceled #93823
allowed to fail
robotpkg-py-curves-py3-16.04-release

00:03:56

failed #93824
robotpkg-py-curves-py3-18.04-release

00:01:24

failed #93826
robotpkg-py-curves-py3-20.04-release

00:02:38

canceled #93840
robotpkg-py-curves-py3-buster-release

00:00:18

canceled #93828
allowed to fail
robotpkg-py-curves-py3-stretch-release

00:03:55

failed #93827
robotpkg-py-curves-py3-buster-release

00:03:38

 
Name Stage Failure
failed
robotpkg-py-curves-py3-20.04-release Test
ERROR: missing:	/opt/openrobots/include/curves/config.hh
ERROR:
ERROR: Please reinstall the package in ../../math/curves
ERROR: ======================================================================
make: *** [/root/robotpkg/mk/depends/depends.mk:70: do-depends] Error 1
make: *** [/root/robotpkg/mk/internal/trusted.mk:36: install] Error 2
Running after_script
Uploading artifacts for failed job
ERROR: Job failed: exit code 1
failed
doc-coverage Test
Running after_script
Running after script...
$ cd /root/robotpkg/math/py-curves
$ build=$(make show-var VARNAME=CONFIGURE_DIRS); cd $(make show-var VARNAME=WRKSRC); cd $build
$ make doc
make: Nothing to be done for 'doc'.
$ mv doc/doxygen-html ${CI_PROJECT_DIR}
mv: cannot stat 'doc/doxygen-html': No such file or directory
ERROR: Job failed: exit code 1
failed
robotpkg-py-curves-py2-18.04-release Test
ERROR: missing:	/opt/openrobots/include/curves/config.hh
ERROR:
ERROR: Please reinstall the package in ../../math/curves
ERROR: ======================================================================
make: *** [do-depends] Error 1
/root/robotpkg/mk/depends/depends.mk:70: recipe for target 'do-depends' failed
make: *** [install] Error 2
/root/robotpkg/mk/internal/trusted.mk:36: recipe for target 'install' failed
ERROR: Job failed: exit code 1
failed
robotpkg-py-curves-py3-18.04-release Test
ERROR: missing:	/opt/openrobots/include/curves/config.hh
ERROR:
ERROR: Please reinstall the package in ../../math/curves
ERROR: ======================================================================
/root/robotpkg/mk/depends/depends.mk:70: recipe for target 'do-depends' failed
make: *** [do-depends] Error 1
make: *** [install] Error 2
/root/robotpkg/mk/internal/trusted.mk:36: recipe for target 'install' failed
ERROR: Job failed: exit code 1