Python Format

9 jobs for v0.3.0 in 4 minutes and 1 second (queued for 5 seconds)
latest
Status Job ID Name Coverage
  Test
failed doc-coverage #93812

00:01:52

passed format #93813

00:00:22

passed robotpkg-curves-18.04-release #93805

00:02:19

failed robotpkg-py-curves-py2-18.04-release #93808

00:01:53

canceled robotpkg-py-curves-py3-16.04-release #93806
allowed to fail

00:03:59

failed robotpkg-py-curves-py3-18.04-release #93807

00:01:53

failed robotpkg-py-curves-py3-20.04-release #93809

00:01:32

canceled robotpkg-py-curves-py3-buster-release #93810

00:04:00

failed robotpkg-py-curves-py3-stretch-release #93811
allowed to fail

00:01:29

 
Name Stage Failure
failed
doc-coverage Test
Running after_script
Running after script...
$ cd /root/robotpkg/math/py-curves
$ build=$(make show-var VARNAME=CONFIGURE_DIRS); cd $(make show-var VARNAME=WRKSRC); cd $build
$ make doc
make: Nothing to be done for 'doc'.
$ mv doc/doxygen-html ${CI_PROJECT_DIR}
mv: cannot stat 'doc/doxygen-html': No such file or directory
ERROR: Job failed: exit code 1
failed
robotpkg-py-curves-py3-20.04-release Test
ERROR: found:	/opt/openrobots/include/curves/config.hh, wrong version 0.3.0
ERROR: missing: /opt/openrobots/include/curves/config.hh
ERROR:
ERROR: Please reinstall the package in ../../math/curves
ERROR: ======================================================================
make: *** [/root/robotpkg/mk/depends/depends.mk:70: do-depends] Error 1
make: *** [/root/robotpkg/mk/internal/trusted.mk:36: install] Error 2
Cleaning up file based variables
ERROR: Job failed: exit code 1
failed
robotpkg-py-curves-py3-18.04-release Test
ERROR: Please reinstall the package in ../../math/curves
ERROR: ======================================================================
make: *** [do-depends] Error 1
/root/robotpkg/mk/depends/depends.mk:70: recipe for target 'do-depends' failed
make: *** [install] Error 2
/root/robotpkg/mk/internal/trusted.mk:36: recipe for target 'install' failed
Running after_script
Uploading artifacts for failed job
ERROR: Job failed: exit code 1
failed
robotpkg-py-curves-py3-stretch-release Test
ERROR: 
ERROR: Please reinstall the package in ../../math/curves
ERROR: ======================================================================
make: *** [do-depends] Error 1
/root/robotpkg/mk/depends/depends.mk:70: recipe for target 'do-depends' failed
/root/robotpkg/mk/internal/trusted.mk:36: recipe for target 'install' failed
make: *** [install] Error 2
Cleaning up file based variables
ERROR: Job failed: exit code 1
failed
robotpkg-py-curves-py2-18.04-release Test
ERROR: Please reinstall the package in ../../math/curves
ERROR: ======================================================================
make: *** [do-depends] Error 1
/root/robotpkg/mk/depends/depends.mk:70: recipe for target 'do-depends' failed
make: *** [install] Error 2
/root/robotpkg/mk/internal/trusted.mk:36: recipe for target 'install' failed
Running after_script
Uploading artifacts for failed job
ERROR: Job failed: exit code 1