[Format]

9 jobs for v0.2.0 in 4 minutes and 5 seconds (queued for 3 seconds)
latest
Status Job ID Name Coverage
  Test
failed #93796
doc-coverage

00:01:58

passed #93798
format

00:00:19

passed #93787
robotpkg-curves-18.04-release

00:01:43

failed #93790
robotpkg-py-curves-py2-18.04-release

00:01:44

canceled #93788
allowed to fail
robotpkg-py-curves-py3-16.04-release

00:04:04

failed #93789
robotpkg-py-curves-py3-18.04-release

00:00:50

failed #93792
robotpkg-py-curves-py3-20.04-release

00:01:29

failed #93793
robotpkg-py-curves-py3-buster-release

00:00:50

failed #93794
allowed to fail
robotpkg-py-curves-py3-stretch-release

00:00:55

 
Name Stage Failure
failed
doc-coverage Test
/root/robotpkg/mk/internal/trusted.mk:36: recipe for target 'install' failed
make: *** [install] Error 2
Running after_script
Running after script...
$ cd /root/robotpkg/math/py-curves
$ build=$(make show-var VARNAME=CONFIGURE_DIRS); cd $(make show-var VARNAME=WRKSRC); cd $build
$ make doc
make: *** No rule to make target 'doc'. Stop.
ERROR: Job failed: exit code 1
failed
robotpkg-py-curves-py2-18.04-release Test
ERROR: missing:	/opt/openrobots/include/curves/config.hh
ERROR:
ERROR: Please reinstall the package in ../../math/curves
ERROR: ======================================================================
/root/robotpkg/mk/depends/depends.mk:70: recipe for target 'do-depends' failed
make: *** [do-depends] Error 1
/root/robotpkg/mk/internal/trusted.mk:36: recipe for target 'install' failed
make: *** [install] Error 2
ERROR: Job failed: exit code 1
failed
robotpkg-py-curves-py3-20.04-release Test
ERROR: missing:	/opt/openrobots/include/curves/config.hh
ERROR:
ERROR: Please reinstall the package in ../../math/curves
ERROR: ======================================================================
make: *** [/root/robotpkg/mk/depends/depends.mk:70: do-depends] Error 1
make: *** [/root/robotpkg/mk/internal/trusted.mk:36: install] Error 2
Running after_script
Uploading artifacts for failed job
ERROR: Job failed: exit code 1
failed
robotpkg-py-curves-py3-stretch-release Test
ERROR: missing:	/opt/openrobots/include/curves/config.hh
ERROR:
ERROR: Please reinstall the package in ../../math/curves
ERROR: ======================================================================
make: *** [do-depends] Error 1
/root/robotpkg/mk/depends/depends.mk:70: recipe for target 'do-depends' failed
/root/robotpkg/mk/internal/trusted.mk:36: recipe for target 'install' failed
make: *** [install] Error 2
ERROR: Job failed: exit code 1
failed
robotpkg-py-curves-py3-18.04-release Test
ERROR: missing:	/opt/openrobots/include/curves/config.hh
ERROR:
ERROR: Please reinstall the package in ../../math/curves
ERROR: ======================================================================
make: *** [do-depends] Error 1
/root/robotpkg/mk/depends/depends.mk:70: recipe for target 'do-depends' failed
/root/robotpkg/mk/internal/trusted.mk:36: recipe for target 'install' failed
make: *** [install] Error 2
ERROR: Job failed: exit code 1
failed
robotpkg-py-curves-py3-buster-release Test
ERROR: found:	/opt/openrobots/include/curves/config.hh, wrong version 0.2.0
ERROR: missing: /opt/openrobots/include/curves/config.hh
ERROR:
ERROR: Please reinstall the package in ../../math/curves
ERROR: ======================================================================
make: *** [/root/robotpkg/mk/depends/depends.mk:70: do-depends] Error 1
make: *** [/root/robotpkg/mk/internal/trusted.mk:36: install] Error 2
Cleaning up file based variables
ERROR: Job failed: exit code 1