[tests/python] Remove unnecessary call to rospack

10 jobs for pr/3 in 35 minutes and 2 seconds (queued for 2 seconds)
latest
Status Name Job ID Coverage
  Test
failed doc-coverage #71784

00:35:01

failed format #71785
allowed to fail

00:02:45

failed robotpkg-py-sot-talos-balance-16.04-debug #71777

00:12:50

failed robotpkg-py-sot-talos-balance-16.04-release #71776

00:24:56

failed robotpkg-py-sot-talos-balance-18.04-debug #71779

00:13:40

failed robotpkg-py-sot-talos-balance-18.04-release #71778

00:28:09

passed robotpkg-sot-talos-balance-16.04-debug #71781

00:07:41

passed robotpkg-sot-talos-balance-16.04-release #71780

00:13:42

passed robotpkg-sot-talos-balance-18.04-debug #71783

00:07:41

passed robotpkg-sot-talos-balance-18.04-release #71782

00:15:15

 
Name Stage Failure
failed
doc-coverage Test
src/utils/statistics.cpp                      95       0     0%   26,28-29,32-33,35,38,40,43,45,48,50,53,55,57,60,63-66,69,72,74,76,78-79,83,85,87-91,95,97,100-101,103,105-109,112,114-115,118,120-121,124,126,129-130,132,134-136,138-150,153,156-157,159,161,165,168-169,171,173,177,180-181,183,185,189,192-193,195,197,201,204-205,207,209
tests/dummy.cpp 6 6 100%
tests/test_distribute.cpp 185 185 100%
------------------------------------------------------------------------------
TOTAL 8722 1258 14%
------------------------------------------------------------------------------
$ gcovr -r . --html --html-details -o ${CI_PROJECT_DIR}/coverage/index.html
Uploading artifacts for failed job
ERROR: Job failed: exit code 1
failed
robotpkg-py-sot-talos-balance-18.04-release Test
	 19 - py-test_example (Failed)
23 - py-test_simple_distribute (Failed)
26 - py-test_state_transformation (Failed)
Errors while running CTest
Makefile:109: recipe for target 'test' failed
make: *** [test] Error 8
Running after_script
Uploading artifacts for failed job
ERROR: Job failed: exit code 1
failed
robotpkg-py-sot-talos-balance-16.04-release Test
	 19 - py-test_example (Failed)
23 - py-test_simple_distribute (Failed)
26 - py-test_state_transformation (Failed)
Errors while running CTest
make: *** [test] Error 8
Makefile:75: recipe for target 'test' failed
Running after_script
Uploading artifacts for failed job
ERROR: Job failed: exit code 1
failed
format Test
   BOOST_CHECK(!stop);
-
}

-BOOST_AUTO_TEST_SUITE_END ()
+BOOST_AUTO_TEST_SUITE_END()
Running after_script
Uploading artifacts for failed job
ERROR: Job failed: exit code 1
failed
robotpkg-py-sot-talos-balance-16.04-debug Test
	 19 - py-test_example (Failed)
23 - py-test_simple_distribute (Failed)
26 - py-test_state_transformation (Failed)
Errors while running CTest
Makefile:75: recipe for target 'test' failed
make: *** [test] Error 8
Running after_script
Uploading artifacts for failed job
ERROR: Job failed: exit code 1
failed
robotpkg-py-sot-talos-balance-18.04-debug Test
	 19 - py-test_example (Failed)
23 - py-test_simple_distribute (Failed)
26 - py-test_state_transformation (Failed)
Errors while running CTest
Makefile:109: recipe for target 'test' failed
make: *** [test] Error 8
Running after_script
Uploading artifacts for failed job
ERROR: Job failed: exit code 1