Add dynamic-graph-python to package.xml

and add missing dependencies.
14 jobs for cmake-export in 3 minutes and 40 seconds (queued for 3 seconds)
latest
Status Name Job ID Coverage
  Test
failed doc-coverage #52658

00:03:37

failed format #52659
allowed to fail

00:00:17

failed robotpkg-py-sot-talos-balance-16.04-debug #52647

00:01:30

failed robotpkg-py-sot-talos-balance-16.04-release #52646

00:01:56

failed robotpkg-py-sot-talos-balance-18.04-debug #52649

00:00:32

failed robotpkg-py-sot-talos-balance-18.04-release #52648

00:03:39

failed robotpkg-py-sot-talos-balance-stretch-debug #52651

00:03:21

failed robotpkg-py-sot-talos-balance-stretch-release #52650

00:01:29

failed robotpkg-sot-talos-balance-16.04-debug #52653

00:02:03

failed robotpkg-sot-talos-balance-16.04-release #52652

00:01:52

failed robotpkg-sot-talos-balance-18.04-debug #52655

00:01:25

failed robotpkg-sot-talos-balance-18.04-release #52654

00:03:30

failed robotpkg-sot-talos-balance-stretch-debug #52657

00:01:25

failed robotpkg-sot-talos-balance-stretch-release #52656

00:00:30

 
Name Stage Failure
failed
doc-coverage Test
make: *** [install] Error 2
Running after script...
$ cd /root/robotpkg/wip/py-sot-talos-balance
$ build=$(make show-var VARNAME=CONFIGURE_DIRS); cd $(make show-var VARNAME=WRKSRC); cd $build
$ make doc
make: Nothing to be done for 'doc'.
$ mv doc/doxygen-html ${CI_PROJECT_DIR}
mv: cannot stat 'doc/doxygen-html': No such file or directory
ERROR: Job failed: exit code 1
failed
robotpkg-py-sot-talos-balance-16.04-release Test
For details or bug reports, check the complete log file in:
/root/robotpkg/wip/sot-talos-balance/work.runner-ULfN9w-c-project-273-concurrent-0/configure.log
/root/robotpkg/mk/configure/cmake-configure.mk:100: recipe for target 'do-configure-cmake' failed
make[1]: *** [do-configure-cmake] Error 1
/root/robotpkg/mk/depends/depends.mk:70: recipe for target 'do-depends' failed
make: *** [do-depends] Error 1
/root/robotpkg/mk/internal/trusted.mk:36: recipe for target 'install' failed
make: *** [install] Error 2
ERROR: Job failed: exit code 1
failed
robotpkg-sot-talos-balance-18.04-release Test
| See also "/root/robotpkg/wip/sot-talos-balance/work.runner-tRjAffv3-project-273-concurrent-2/sot-talos-balance-1.7.0/CMakeFiles/CMakeError.log".

For details or bug reports, check the complete log file in:
/root/robotpkg/wip/sot-talos-balance/work.runner-tRjAffv3-project-273-concurrent-2/configure.log
/root/robotpkg/mk/configure/cmake-configure.mk:100: recipe for target 'do-configure-cmake' failed
make: *** [do-configure-cmake] Error 1
make: *** [install] Error 2
/root/robotpkg/mk/internal/trusted.mk:36: recipe for target 'install' failed
ERROR: Job failed: exit code 1
failed
robotpkg-sot-talos-balance-18.04-debug Test
| See also "/root/robotpkg/wip/sot-talos-balance/work.runner-7gqkM7SY-project-273-concurrent-2/sot-talos-balance-1.7.0/CMakeFiles/CMakeError.log".

For details or bug reports, check the complete log file in:
/root/robotpkg/wip/sot-talos-balance/work.runner-7gqkM7SY-project-273-concurrent-2/configure.log
/root/robotpkg/mk/configure/cmake-configure.mk:100: recipe for target 'do-configure-cmake' failed
make: *** [do-configure-cmake] Error 1
make: *** [install] Error 2
/root/robotpkg/mk/internal/trusted.mk:36: recipe for target 'install' failed
ERROR: Job failed: exit code 1
failed
robotpkg-sot-talos-balance-stretch-release Test
| See also "/root/robotpkg/wip/sot-talos-balance/work.runner-sWwLEjyc-project-273-concurrent-2/sot-talos-balance-1.7.0/CMakeFiles/CMakeError.log".

For details or bug reports, check the complete log file in:
/root/robotpkg/wip/sot-talos-balance/work.runner-sWwLEjyc-project-273-concurrent-2/configure.log
make: *** [do-configure-cmake] Error 1
/root/robotpkg/mk/configure/cmake-configure.mk:100: recipe for target 'do-configure-cmake' failed
make: *** [install] Error 2
/root/robotpkg/mk/internal/trusted.mk:36: recipe for target 'install' failed
ERROR: Job failed: exit code 1
failed
format Test
   stop = distribute.m_emergencyStopSOUT(2);
BOOST_CHECK(!stop);
-
}

-BOOST_AUTO_TEST_SUITE_END ()
-
+BOOST_AUTO_TEST_SUITE_END()
ERROR: Job failed: exit code 1
failed
robotpkg-py-sot-talos-balance-18.04-release Test
For details or bug reports, check the complete log file in:
/root/robotpkg/wip/sot-talos-balance/work.runner-tRjAffv3-project-273-concurrent-0/configure.log
/root/robotpkg/mk/configure/cmake-configure.mk:100: recipe for target 'do-configure-cmake' failed
make[1]: *** [do-configure-cmake] Error 1
/root/robotpkg/mk/depends/depends.mk:70: recipe for target 'do-depends' failed
make: *** [do-depends] Error 1
make: *** [install] Error 2
/root/robotpkg/mk/internal/trusted.mk:36: recipe for target 'install' failed
ERROR: Job failed: exit code 1
failed
robotpkg-py-sot-talos-balance-stretch-debug Test
For details or bug reports, check the complete log file in:
/root/robotpkg/wip/sot-talos-balance/work.runner-tRjAffv3-project-273-concurrent-1/configure.log
make[1]: *** [do-configure-cmake] Error 1
/root/robotpkg/mk/configure/cmake-configure.mk:100: recipe for target 'do-configure-cmake' failed
make: *** [do-depends] Error 1
/root/robotpkg/mk/depends/depends.mk:70: recipe for target 'do-depends' failed
make: *** [install] Error 2
/root/robotpkg/mk/internal/trusted.mk:36: recipe for target 'install' failed
ERROR: Job failed: exit code 1
failed
robotpkg-sot-talos-balance-16.04-release Test
| See also "/root/robotpkg/wip/sot-talos-balance/work.runner-ULfN9w-c-project-273-concurrent-1/sot-talos-balance-1.7.0/CMakeFiles/CMakeError.log".
For details or bug reports, check the complete log file in:
/root/robotpkg/wip/sot-talos-balance/work.runner-ULfN9w-c-project-273-concurrent-1/configure.log

/root/robotpkg/mk/configure/cmake-configure.mk:100: recipe for target 'do-configure-cmake' failed
make: *** [do-configure-cmake] Error 1
make: *** [install] Error 2
/root/robotpkg/mk/internal/trusted.mk:36: recipe for target 'install' failed
ERROR: Job failed: exit code 1
failed
robotpkg-py-sot-talos-balance-16.04-debug Test
For details or bug reports, check the complete log file in:
/root/robotpkg/wip/sot-talos-balance/work.runner-7gqkM7SY-project-273-concurrent-0/configure.log
/root/robotpkg/mk/configure/cmake-configure.mk:100: recipe for target 'do-configure-cmake' failed
make[1]: *** [do-configure-cmake] Error 1
make: *** [do-depends] Error 1
/root/robotpkg/mk/depends/depends.mk:70: recipe for target 'do-depends' failed
make: *** [install] Error 2
/root/robotpkg/mk/internal/trusted.mk:36: recipe for target 'install' failed
ERROR: Job failed: exit code 1
failed
robotpkg-py-sot-talos-balance-stretch-release Test
For details or bug reports, check the complete log file in:
/root/robotpkg/wip/sot-talos-balance/work.runner-7gqkM7SY-project-273-concurrent-1/configure.log
make[1]: *** [do-configure-cmake] Error 1
/root/robotpkg/mk/configure/cmake-configure.mk:100: recipe for target 'do-configure-cmake' failed
/root/robotpkg/mk/depends/depends.mk:70: recipe for target 'do-depends' failed
make: *** [do-depends] Error 1
make: *** [install] Error 2
/root/robotpkg/mk/internal/trusted.mk:36: recipe for target 'install' failed
ERROR: Job failed: exit code 1
failed
robotpkg-sot-talos-balance-16.04-debug Test
| See also "/root/robotpkg/wip/sot-talos-balance/work.runner-sWwLEjyc-project-273-concurrent-1/sot-talos-balance-1.7.0/CMakeFiles/CMakeError.log".

For details or bug reports, check the complete log file in:
/root/robotpkg/wip/sot-talos-balance/work.runner-sWwLEjyc-project-273-concurrent-1/configure.log
/root/robotpkg/mk/configure/cmake-configure.mk:100: recipe for target 'do-configure-cmake' failed
make: *** [do-configure-cmake] Error 1
make: *** [install] Error 2
/root/robotpkg/mk/internal/trusted.mk:36: recipe for target 'install' failed
ERROR: Job failed: exit code 1
failed
robotpkg-sot-talos-balance-stretch-debug Test
| See also "/root/robotpkg/wip/sot-talos-balance/work.runner-7gqkM7SY-project-273-concurrent-3/sot-talos-balance-1.7.0/CMakeFiles/CMakeError.log".

For details or bug reports, check the complete log file in:
/root/robotpkg/wip/sot-talos-balance/work.runner-7gqkM7SY-project-273-concurrent-3/configure.log
make: *** [do-configure-cmake] Error 1
/root/robotpkg/mk/configure/cmake-configure.mk:100: recipe for target 'do-configure-cmake' failed
/root/robotpkg/mk/internal/trusted.mk:36: recipe for target 'install' failed
make: *** [install] Error 2
ERROR: Job failed: exit code 1
failed
robotpkg-py-sot-talos-balance-18.04-debug Test
/root/robotpkg/wip/sot-talos-balance/work.runner-sWwLEjyc-project-273-concurrent-0/configure.log

make[1]: *** [do-configure-cmake] Error 1
/root/robotpkg/mk/configure/cmake-configure.mk:100: recipe for target 'do-configure-cmake' failed
make: *** [do-depends] Error 1
/root/robotpkg/mk/depends/depends.mk:70: recipe for target 'do-depends' failed
/root/robotpkg/mk/internal/trusted.mk:36: recipe for target 'install' failed
make: *** [install] Error 2
ERROR: Job failed: exit code 1