[CMake] add fooClass to test-cython

10 jobs for pr/27 in 1 minute and 41 seconds (queued for 8 seconds)
Status Name Job ID Coverage
  Test
failed doc-coverage #134592

00:00:27

failed format #134593

00:00:28

failed robotpkg-py-sot-talos-balance-18.04 #134584
allowed to fail

00:00:25

failed robotpkg-py-sot-talos-balance-20.04 #134585
allowed to fail

00:01:09

failed robotpkg-py-sot-talos-balance-buster #134586

00:01:40

failed robotpkg-py-sot-talos-balance-ferrum #134587
allowed to fail

00:01:35

failed robotpkg-sot-talos-balance-18.04 #134588
allowed to fail

00:00:24

failed robotpkg-sot-talos-balance-20.04 #134589
allowed to fail

00:01:03

failed robotpkg-sot-talos-balance-buster #134590
allowed to fail

00:01:01

failed robotpkg-sot-talos-balance-ferrum #134591
allowed to fail

00:01:40

 
Name Stage Failure
failed
robotpkg-sot-talos-balance-ferrum Test

For details or bug reports, check the complete log file in:
/root/robotpkg/wip/sot-talos-balance/work/configure.log
/root/robotpkg/mk/configure/cmake-configure.mk:100: recipe for target 'do-configure-cmake' failed
make: *** [do-configure-cmake] Error 1
/root/robotpkg/mk/internal/trusted.mk:36: recipe for target 'install' failed
make: *** [install] Error 2
Cleaning up project directory and file based variables
ERROR: Job failed: exit code 1

failed
robotpkg-py-sot-talos-balance-buster Test
| See also "/root/robotpkg/wip/sot-talos-balance/work/sot-talos-balance-2.0.3/CMakeFiles/CMakeError.log".

For details or bug reports, check the complete log file in:
/root/robotpkg/wip/sot-talos-balance/work/configure.log
make[1]: *** [/root/robotpkg/mk/configure/cmake-configure.mk:100: do-configure-cmake] Error 1
make: *** [/root/robotpkg/mk/depends/depends.mk:70: do-depends] Error 1
make: *** [/root/robotpkg/mk/internal/trusted.mk:36: install] Error 2
Cleaning up project directory and file based variables
ERROR: Job failed: exit code 1

failed
robotpkg-py-sot-talos-balance-ferrum Test
/root/robotpkg/wip/sot-talos-balance/work/configure.log
make[1]: *** [do-configure-cmake] Error 1
/root/robotpkg/mk/configure/cmake-configure.mk:100: recipe for target 'do-configure-cmake' failed
make: *** [do-depends] Error 1
/root/robotpkg/mk/depends/depends.mk:70: recipe for target 'do-depends' failed
/root/robotpkg/mk/internal/trusted.mk:36: recipe for target 'install' failed
make: *** [install] Error 2
Cleaning up project directory and file based variables
ERROR: Job failed: exit code 1

failed
robotpkg-py-sot-talos-balance-20.04 Test
| See also "/root/robotpkg/wip/sot-talos-balance/work/sot-talos-balance-2.0.3/CMakeFiles/CMakeError.log".
For details or bug reports, check the complete log file in:
/root/robotpkg/wip/sot-talos-balance/work/configure.log

make[1]: *** [/root/robotpkg/mk/configure/cmake-configure.mk:100: do-configure-cmake] Error 1
make: *** [/root/robotpkg/mk/depends/depends.mk:70: do-depends] Error 1
make: *** [/root/robotpkg/mk/internal/trusted.mk:36: install] Error 2
Cleaning up project directory and file based variables
ERROR: Job failed: exit code 1

failed
robotpkg-sot-talos-balance-20.04 Test
| See also "/root/robotpkg/wip/sot-talos-balance/work/sot-talos-balance-2.0.3/CMakeFiles/CMakeOutput.log".
| See also "/root/robotpkg/wip/sot-talos-balance/work/sot-talos-balance-2.0.3/CMakeFiles/CMakeError.log".
For details or bug reports, check the complete log file in:
/root/robotpkg/wip/sot-talos-balance/work/configure.log

make: *** [/root/robotpkg/mk/configure/cmake-configure.mk:100: do-configure-cmake] Error 1
make: *** [/root/robotpkg/mk/internal/trusted.mk:36: install] Error 2
Cleaning up project directory and file based variables
ERROR: Job failed: exit code 1

failed
robotpkg-sot-talos-balance-buster Test
| See also "/root/robotpkg/wip/sot-talos-balance/work/sot-talos-balance-2.0.3/CMakeFiles/CMakeOutput.log".
| See also "/root/robotpkg/wip/sot-talos-balance/work/sot-talos-balance-2.0.3/CMakeFiles/CMakeError.log".

For details or bug reports, check the complete log file in:
/root/robotpkg/wip/sot-talos-balance/work/configure.log
make: *** [/root/robotpkg/mk/configure/cmake-configure.mk:100: do-configure-cmake] Error 1
make: *** [/root/robotpkg/mk/internal/trusted.mk:36: install] Error 2
Cleaning up project directory and file based variables
ERROR: Job failed: exit code 1

failed
format Test
./tests/python/test_nmpc_online.py:46:30: E231 missing whitespace after ','
./tests/python/test_nmpc_online.py:46:53: E231 missing whitespace after ','
./tests/python/test_nmpc_online.py:46:58: E231 missing whitespace after ','
./tests/python/test_cython.py:3:1: F401 'numpy as np' imported but unused
./tests/python/test_cython.py:25:18: E203 whitespace before ','
./tests/python/test_cython.py:25:19: E231 missing whitespace after ','
./tests/python/test_cython.py:27:1: W391 blank line at end of file
Cleaning up project directory and file based variables
ERROR: Job failed: exit code 1

failed
doc-coverage Test
Running after script...
$ cd /root/robotpkg/wip/py-sot-talos-balance
$ build=$(make show-var VARNAME=CONFIGURE_DIRS); cd $(make show-var VARNAME=WRKSRC); cd $build
$ make doc
make: Nothing to be done for 'doc'.
$ mv doc/doxygen-html ${CI_PROJECT_DIR}
mv: cannot stat 'doc/doxygen-html': No such file or directory
Cleaning up project directory and file based variables
ERROR: Job failed: exit code 1

failed
robotpkg-py-sot-talos-balance-18.04 Test
/root/robotpkg/wip/sot-talos-balance/work/configure.log
/root/robotpkg/mk/configure/cmake-configure.mk:100: recipe for target 'do-configure-cmake' failed
make[1]: *** [do-configure-cmake] Error 1
make: *** [do-depends] Error 1
/root/robotpkg/mk/depends/depends.mk:70: recipe for target 'do-depends' failed
/root/robotpkg/mk/internal/trusted.mk:36: recipe for target 'install' failed
make: *** [install] Error 2
Cleaning up project directory and file based variables
ERROR: Job failed: exit code 1

failed
robotpkg-sot-talos-balance-18.04 Test

For details or bug reports, check the complete log file in:
/root/robotpkg/wip/sot-talos-balance/work/configure.log
/root/robotpkg/mk/configure/cmake-configure.mk:100: recipe for target 'do-configure-cmake' failed
make: *** [do-configure-cmake] Error 1
make: *** [install] Error 2
/root/robotpkg/mk/internal/trusted.mk:36: recipe for target 'install' failed
Cleaning up project directory and file based variables
ERROR: Job failed: exit code 1