v2.0.0

4 jobs for v2.0.0 in 1 minute and 50 seconds (queued for 3 seconds)
latest
Status Name Job ID Coverage
  Test
failed doc-coverage #98196

00:00:02

failed format #98197
allowed to fail

00:00:38

failed robotpkg-py-sot-talos-balance-py2-18.04-release #98194

00:01:48

failed robotpkg-sot-talos-balance-18.04-release #98195

00:01:17

 
Name Stage Failure
failed
doc-coverage Test
Running with gitlab-runner 13.5.0 (ece86343)
on asahi zUWCHYoo
Preparing the "docker" executor
Using Docker executor with image memmos.laas.fr:5000/loco-3d/sot-talos-balance/py-sot-talos-balance-py3:18.04 ...
Pulling docker image memmos.laas.fr:5000/loco-3d/sot-talos-balance/py-sot-talos-balance-py3:18.04 ...
ERROR: Job failed: Error response from daemon: manifest for memmos.laas.fr:5000/loco-3d/sot-talos-balance/py-sot-talos-balance-py3:18.04 not found: manifest unknown: manifest unknown (docker.go:142:0s)
failed
robotpkg-py-sot-talos-balance-py2-18.04-release Test
ERROR:
ERROR: See /root/robotpkg/wip/py-sot-talos-balance/work.runner-jmn42dp2-project-273-concurrent-1/sysdep.log for details.
ERROR: ======================================================================
/root/robotpkg/mk/depends/depends.mk:70: recipe for target 'do-depends' failed
make: *** [do-depends] Error 1
make: *** [install] Error 2
/root/robotpkg/mk/internal/trusted.mk:36: recipe for target 'install' failed
Cleaning up file based variables
ERROR: Job failed: exit code 1
failed
robotpkg-sot-talos-balance-18.04-release Test
ERROR:
ERROR: See /root/robotpkg/wip/sot-talos-balance/work.runner-swwlejyc-project-273-concurrent-3/sysdep.log for details.
ERROR: ======================================================================
/root/robotpkg/mk/depends/depends.mk:70: recipe for target 'do-depends' failed
make: *** [do-depends] Error 1
/root/robotpkg/mk/internal/trusted.mk:36: recipe for target 'install' failed
make: *** [install] Error 2
Cleaning up file based variables
ERROR: Job failed: exit code 1
failed
format Test
+BOOST_PYTHON_MODULE(wrap) {
bp::import("dynamic_graph");

- dg::python::exposeEntity<dg::sot::talos_balance::TalosControlManager, bp::bases<dg::Entity>, dg::python::AddSignals & dg::python::AddCommands>() ;
+ dg::python::exposeEntity<dg::sot::talos_balance::TalosControlManager, bp::bases<dg::Entity>,
+ dg::python::AddSignals & dg::python::AddCommands>();
}
Cleaning up file based variables
ERROR: Job failed: exit code 1