[ddp] compile error

8 jobs for pr/867 in 78 minutes and 4 seconds (queued for 1 second)
latest
Name Stage Failure
failed
doc-coverage Test
unittest/test_states.cpp                     223     223   100%   
unittest/test_wrench_cone.cpp 75 75 100%
unittest/unittest_common.hpp 66 55 83% 53,58,87,139-142,144,147-148 [* 145]
------------------------------------------------------------------------------
TOTAL 13596 10048 73%
------------------------------------------------------------------------------
$ gcovr -e CMakeFiles -r . --html --html-details -o ${CI_PROJECT_DIR}/coverage/index.html
Uploading artifacts for failed job
ERROR: Job failed: exit code 1
failed
robotpkg-py-crocoddyl-py3-stretch-release Test
The following tests FAILED:
1 - test_states (SEGFAULT)
4 - test_costs (SEGFAULT)
6 - test_contacts (SEGFAULT)
Errors while running CTest
Makefile:85: recipe for target 'test' failed
make: *** [test] Error 8
Cleaning up file based variables
ERROR: Job failed: exit code 1
failed
robotpkg-py-crocoddyl-py3-buster-release Test
98% tests passed, 1 tests failed out of 43

Total Test time (real) = 58.67 sec

The following tests FAILED:
11 - test_diff_actions (Child aborted)
Errors while running CTest
make: *** [Makefile:110: test] Error 8
ERROR: Job failed: exit code 1
failed
robotpkg-py-crocoddyl-py3-16.04-release Test

Total Test time (real) = 64.15 sec

The following tests FAILED:
15 - test_boxqp (Failed)
Errors while running CTest
Makefile:85: recipe for target 'test' failed
make: *** [test] Error 8
ERROR: Job failed: exit code 1