[cleanup] Initilized the BoxQP data

8 jobs for pr/863 in 88 minutes and 10 seconds (queued for 1 second)
latest
Name Stage Failure
failed
robotpkg-py-crocoddyl-py3-16.04-release Test

The following tests FAILED:
15 - test_boxqp (Failed)
Errors while running CTest
Makefile:85: recipe for target 'test' failed
make: *** [test] Error 8
Running after_script
Uploading artifacts for failed job
ERROR: Job failed: exit code 1
failed
robotpkg-py-crocoddyl-py3-stretch-release Test
The following tests FAILED:
1 - test_states (SEGFAULT)
4 - test_costs (SEGFAULT)
6 - test_contacts (SEGFAULT)
Errors while running CTest
Makefile:85: recipe for target 'test' failed
make: *** [test] Error 8
Cleaning up file based variables
ERROR: Job failed: exit code 1
failed
robotpkg-py-crocoddyl-py3-buster-release Test

Total Test time (real) = 28.77 sec

The following tests FAILED:
11 - test_diff_actions (Child aborted)
Errors while running CTest
make: *** [Makefile:110: test] Error 8
Cleaning up file based variables
ERROR: Job failed: exit code 1