[LiegroupElement] Add operators == and !=.

7 jobs for devel in 2 minutes and 24 seconds (queued for 1 second)
Status Name Job ID Coverage
  Test
failed doc-coverage #105118

00:01:37

failed format #105119
allowed to fail

00:02:01

failed robotpkg-hpp-pinocchio-16.04-release #105113

00:02:11

failed robotpkg-hpp-pinocchio-18.04-release #105114

00:01:26

failed robotpkg-hpp-pinocchio-20.04-release #105115

00:02:23

failed robotpkg-hpp-pinocchio-buster-release #105116

00:01:32

failed robotpkg-hpp-pinocchio-stretch-release #105117

00:02:15

 
Name Stage Failure
failed
doc-coverage Test
Directory: .
------------------------------------------------------------------------------
File Lines Exec Cover Missing
------------------------------------------------------------------------------
------------------------------------------------------------------------------
TOTAL 0 0 --%
------------------------------------------------------------------------------
$ gcovr -e CMakeFiles -r . --html --html-details -o ${CI_PROJECT_DIR}/coverage/index.html
ERROR: Job failed: exit code 1
failed
robotpkg-hpp-pinocchio-16.04-release Test

For details or bug reports, check the complete log file in:
/root/robotpkg/math/hpp-pinocchio/work.runner-ke6dzkhd-project-184-concurrent-0/build.log
make: *** [do-build] Error 2
/root/robotpkg/mk/build/build.mk:198: recipe for target 'do-build' failed
make: *** [install] Error 2
/root/robotpkg/mk/internal/trusted.mk:36: recipe for target 'install' failed
Cleaning up file based variables
ERROR: Job failed: exit code 1
failed
robotpkg-hpp-pinocchio-stretch-release Test

For details or bug reports, check the complete log file in:
/root/robotpkg/math/hpp-pinocchio/work.runner-ke6dzkhd-project-184-concurrent-2/build.log
make: *** [do-build] Error 2
/root/robotpkg/mk/build/build.mk:198: recipe for target 'do-build' failed
/root/robotpkg/mk/internal/trusted.mk:36: recipe for target 'install' failed
make: *** [install] Error 2
Cleaning up file based variables
ERROR: Job failed: exit code 1
failed
robotpkg-hpp-pinocchio-buster-release Test
| make[2]: *** [CMakeFiles/hpp-pinocchio.dir/build.make:66: CMakeFiles/hpp-pinocchio.dir/src/device.cc.o] Error 1
| make[1]: *** [CMakeFiles/Makefile2:300: CMakeFiles/hpp-pinocchio.dir/all] Error 2
| make: *** [Makefile:144: all] Error 2

For details or bug reports, check the complete log file in:
/root/robotpkg/math/hpp-pinocchio/work.runner-5nsakv6-project-184-concurrent-1/build.log
make: *** [/root/robotpkg/mk/build/build.mk:199: do-build] Error 2
make: *** [/root/robotpkg/mk/internal/trusted.mk:36: install] Error 2
ERROR: Job failed: exit code 1
failed
format Test
+  BOOST_CHECK(J.isApprox((J * p2m::Xq(R)) * m2p::Xq(R)));
+ BOOST_CHECK(((J * m2p::Xq(R)) * (p2m::Xq(R) * v)).isApprox(J * v));

::pinocchio::SE3 Mp = ::pinocchio::SE3::Random();
- BOOST_CHECK( Mp.isApprox( m2p::SE3(p2m::SE3(Mp)) ) );
+ BOOST_CHECK(Mp.isApprox(m2p::SE3(p2m::SE3(Mp))));
}
Cleaning up file based variables
ERROR: Job failed: exit code 1
failed
robotpkg-hpp-pinocchio-20.04-release Test
| make[2]: *** [CMakeFiles/hpp-pinocchio.dir/build.make:66: CMakeFiles/hpp-pinocchio.dir/src/device.cc.o] Error 1
| make[1]: *** [CMakeFiles/Makefile2:726: CMakeFiles/hpp-pinocchio.dir/all] Error 2
| make: *** [Makefile:144: all] Error 2
For details or bug reports, check the complete log file in:
/root/robotpkg/math/hpp-pinocchio/work.runner-ke6dzkhd-project-184-concurrent-1/build.log
make: *** [/root/robotpkg/mk/build/build.mk:199: do-build] Error 2
make: *** [/root/robotpkg/mk/internal/trusted.mk:36: install] Error 2
Cleaning up file based variables
ERROR: Job failed: exit code 1
failed
robotpkg-hpp-pinocchio-18.04-release Test
| ^
| make[2]: *** [CMakeFiles/hpp-pinocchio.dir/src/device.cc.o] Error 1
| make[1]: *** [CMakeFiles/hpp-pinocchio.dir/all] Error 2
| make: *** [all] Error 2
For details or bug reports, check the complete log file in:
/root/robotpkg/math/hpp-pinocchio/work.runner-5nsakv6-project-184-concurrent-0/build.log
make: *** [do-build] Error 2
make: *** [install] Error 2
ERROR: Job failed: exit code 1