release: Update package.xml version to 1.7.8

12 jobs for master in 37 minutes and 45 seconds (queued for 5 seconds)
latest
Status Name Job ID Coverage
  Test
passed doc-coverage #134797

00:37:42

77.0%
failed format #134798
allowed to fail

00:04:56

passed robotpkg-hpp-fcl-16.04 #134787

00:17:32

passed robotpkg-hpp-fcl-18.04 #134788

00:11:28

passed robotpkg-hpp-fcl-20.04 #134789

00:01:43

failed robotpkg-hpp-fcl-buster #134790
allowed to fail

00:11:27

passed robotpkg-hpp-fcl-ferrum #134791

00:08:10

passed robotpkg-py-hpp-fcl-16.04 #134792

00:22:59

passed robotpkg-py-hpp-fcl-18.04 #134793

00:12:36

passed robotpkg-py-hpp-fcl-20.04 #134794

00:02:53

failed robotpkg-py-hpp-fcl-buster #134795
allowed to fail

00:19:12

passed robotpkg-py-hpp-fcl-ferrum #134796

00:22:18

 
Name Stage Failure
failed
robotpkg-py-hpp-fcl-buster Test

Total Test time (real) = 75.98 sec

The following tests FAILED:
16 - gjk (Child aborted)
Errors while running CTest
make: *** [Makefile:110: test] Error 8
Cleaning up project directory and file based variables
ERROR: Job failed: exit code 1

failed
robotpkg-hpp-fcl-buster Test
Total Test time (real) = 103.45 sec

The following tests FAILED:
16 - gjk (Child aborted)
18 - serialization (Child aborted)
Errors while running CTest
make: *** [Makefile:110: test] Error 8
Cleaning up project directory and file based variables
ERROR: Job failed: exit code 1

failed
format Test
./test/scripts/geometric_shapes.py:46:40: E231 missing whitespace after ','
./test/scripts/geometric_shapes.py:46:42: E231 missing whitespace after ','
./test/scripts/geometric_shapes.py:46:45: E202 whitespace before ']'
./test/scripts/geometric_shapes.py:47:37: E231 missing whitespace after ','
./test/scripts/geometric_shapes.py:48:6: E201 whitespace after '('
./test/scripts/geometric_shapes.py:49:6: E201 whitespace after '('
./test/scripts/geometric_shapes.py:49:55: E202 whitespace before ']'
Cleaning up project directory and file based variables
ERROR: Job failed: exit code 1