release: Update package.xml version to 1.7.5

12 jobs for v1.7.5 in 26 seconds (queued for 20 seconds)
latest
Status Name Job ID Coverage
  Test
failed doc-coverage #133951

00:00:08

failed format #133952
allowed to fail

00:00:18

failed robotpkg-hpp-fcl-16.04 #133941
allowed to fail

00:00:07

failed robotpkg-hpp-fcl-18.04 #133942
allowed to fail

00:00:19

failed robotpkg-hpp-fcl-20.04 #133943
allowed to fail

00:00:22

failed robotpkg-hpp-fcl-buster #133944
allowed to fail

00:00:17

failed robotpkg-hpp-fcl-ferrum #133945
allowed to fail

00:00:12

failed robotpkg-py-hpp-fcl-16.04 #133946
allowed to fail

00:00:18

failed robotpkg-py-hpp-fcl-18.04 #133947
allowed to fail

00:00:12

failed robotpkg-py-hpp-fcl-20.04 #133948
allowed to fail

00:00:18

failed robotpkg-py-hpp-fcl-buster #133949
allowed to fail

00:00:12

failed robotpkg-py-hpp-fcl-ferrum #133950
allowed to fail

00:00:11

 
Name Stage Failure
failed
format Test
./doc/python/xml_docstring.py:147:23: E211 whitespace before '('
./doc/python/xml_docstring.py:149:17: E211 whitespace before '('
./doc/python/xml_docstring.py:150:20: E211 whitespace before '('
./doc/python/xml_docstring.py:151:23: E211 whitespace before '('
./doc/python/xml_docstring.py:153:16: E211 whitespace before '('
./doc/python/xml_docstring.py:156:28: E211 whitespace before '('
./doc/python/xml_docstring.py:158:28: E211 whitespace before '('
Cleaning up project directory and file based variables
ERROR: Job failed: exit code 1

failed
robotpkg-py-hpp-fcl-20.04 Test
| fatal: clone of 'git://github.com/jrl-umi3218/jrl-cmakemodules.git' into submodule path '/root/robotpkg/path/hpp-fcl/work/hpp-fcl-1.7.5/cmake' failed
| Failed to clone 'cmake' a second time, aborting
For details or bug reports, check the complete log file in:
/root/robotpkg/path/hpp-fcl/work/extract.log

make: *** [/root/robotpkg/mk/extract/checkout.mk:226: do-checkout] Error 1
make: *** [/root/robotpkg/mk/internal/trusted.mk:36: checkout] Error 2
Cleaning up project directory and file based variables
ERROR: Job failed: exit code 1

failed
robotpkg-hpp-fcl-20.04 Test
| fatal: clone of 'git://github.com/jrl-umi3218/jrl-cmakemodules.git' into submodule path '/root/robotpkg/path/hpp-fcl/work/hpp-fcl-1.7.5/cmake' failed
| Failed to clone 'cmake' a second time, aborting
For details or bug reports, check the complete log file in:
/root/robotpkg/path/hpp-fcl/work/extract.log

make: *** [/root/robotpkg/mk/extract/checkout.mk:226: do-checkout] Error 1
make: *** [/root/robotpkg/mk/internal/trusted.mk:36: checkout] Error 2
Cleaning up project directory and file based variables
ERROR: Job failed: exit code 1

failed
robotpkg-py-hpp-fcl-16.04 Test

For details or bug reports, check the complete log file in:
/root/robotpkg/path/hpp-fcl/work/extract.log
/root/robotpkg/mk/extract/checkout.mk:225: recipe for target 'do-checkout' failed
make: *** [do-checkout] Error 128
make: *** [checkout] Error 2
/root/robotpkg/mk/internal/trusted.mk:36: recipe for target 'checkout' failed
Cleaning up project directory and file based variables
ERROR: Job failed: exit code 1

failed
robotpkg-hpp-fcl-18.04 Test

For details or bug reports, check the complete log file in:
/root/robotpkg/path/hpp-fcl/work/extract.log
/root/robotpkg/mk/extract/checkout.mk:225: recipe for target 'do-checkout' failed
make: *** [do-checkout] Error 1
make: *** [checkout] Error 2
/root/robotpkg/mk/internal/trusted.mk:36: recipe for target 'checkout' failed
Cleaning up project directory and file based variables
ERROR: Job failed: exit code 1

failed
robotpkg-py-hpp-fcl-buster Test
| fatal: clone of 'git://github.com/qhull/qhull.git' into submodule path '/root/robotpkg/path/hpp-fcl/work/hpp-fcl-1.7.5/third-parties/qhull' failed
| Failed to clone 'third-parties/qhull' a second time, aborting
For details or bug reports, check the complete log file in:
/root/robotpkg/path/hpp-fcl/work/extract.log

make: *** [/root/robotpkg/mk/extract/checkout.mk:226: do-checkout] Error 1
make: *** [/root/robotpkg/mk/internal/trusted.mk:36: checkout] Error 2
Cleaning up project directory and file based variables
ERROR: Job failed: exit code 1

failed
robotpkg-hpp-fcl-buster Test
| fatal: clone of 'git://github.com/jrl-umi3218/jrl-cmakemodules.git' into submodule path '/root/robotpkg/path/hpp-fcl/work/hpp-fcl-1.7.5/cmake' failed
| Failed to clone 'cmake' a second time, aborting

For details or bug reports, check the complete log file in:
/root/robotpkg/path/hpp-fcl/work/extract.log
make: *** [/root/robotpkg/mk/extract/checkout.mk:226: do-checkout] Error 1
make: *** [/root/robotpkg/mk/internal/trusted.mk:36: checkout] Error 2
Cleaning up project directory and file based variables
ERROR: Job failed: exit code 1

failed
robotpkg-py-hpp-fcl-ferrum Test

For details or bug reports, check the complete log file in:
/root/robotpkg/path/hpp-fcl/work/extract.log
/root/robotpkg/mk/extract/checkout.mk:225: recipe for target 'do-checkout' failed
make: *** [do-checkout] Error 1
/root/robotpkg/mk/internal/trusted.mk:36: recipe for target 'checkout' failed
make: *** [checkout] Error 2
Cleaning up project directory and file based variables
ERROR: Job failed: exit code 1

failed
robotpkg-py-hpp-fcl-18.04 Test

For details or bug reports, check the complete log file in:
/root/robotpkg/path/hpp-fcl/work/extract.log
make: *** [do-checkout] Error 1
/root/robotpkg/mk/extract/checkout.mk:225: recipe for target 'do-checkout' failed
/root/robotpkg/mk/internal/trusted.mk:36: recipe for target 'checkout' failed
make: *** [checkout] Error 2
Cleaning up project directory and file based variables
ERROR: Job failed: exit code 1

failed
robotpkg-hpp-fcl-ferrum Test
For details or bug reports, check the complete log file in:
/root/robotpkg/path/hpp-fcl/work/extract.log
make: *** [do-checkout] Error 1
make: *** [checkout] Error 2

/root/robotpkg/mk/extract/checkout.mk:225: recipe for target 'do-checkout' failed
/root/robotpkg/mk/internal/trusted.mk:36: recipe for target 'checkout' failed
Cleaning up project directory and file based variables
ERROR: Job failed: exit code 1

failed
doc-coverage Test
make: *** [/root/robotpkg/mk/extract/checkout.mk:226: do-checkout] Error 1
make: *** [/root/robotpkg/mk/internal/trusted.mk:36: checkout] Error 2
Running after_script
Running after script...
$ cd /root/robotpkg/path/py-hpp-fcl
$ build=$(make show-var VARNAME=CONFIGURE_DIRS); cd $(make show-var VARNAME=WRKSRC); cd $build
/usr/bin/bash: line 121: cd: /root/robotpkg/path/py-hpp-fcl/work/hpp-fcl-1.7.5: No such file or directory
Cleaning up project directory and file based variables
ERROR: Job failed: exit code 1

failed
robotpkg-hpp-fcl-16.04 Test

For details or bug reports, check the complete log file in:
/root/robotpkg/path/hpp-fcl/work/extract.log
/root/robotpkg/mk/extract/checkout.mk:225: recipe for target 'do-checkout' failed
make: *** [do-checkout] Error 128
/root/robotpkg/mk/internal/trusted.mk:36: recipe for target 'checkout' failed
make: *** [checkout] Error 2
Cleaning up project directory and file based variables
ERROR: Job failed: exit code 1