ros: update version

12 jobs for v1.7.4 in 18 seconds (queued for 13 seconds)
latest
Status Name Job ID Coverage
  Test
canceled doc-coverage #133939

00:00:12

failed format #133940
allowed to fail

00:00:08

canceled robotpkg-hpp-fcl-16.04 #133929
allowed to fail

00:00:18

canceled robotpkg-hpp-fcl-18.04 #133930
allowed to fail

00:00:17

canceled robotpkg-hpp-fcl-20.04 #133931
allowed to fail

00:00:17

canceled robotpkg-hpp-fcl-buster #133932
allowed to fail

00:00:17

canceled robotpkg-hpp-fcl-ferrum #133933
allowed to fail

00:00:16

canceled robotpkg-py-hpp-fcl-16.04 #133934
allowed to fail

00:00:16

failed robotpkg-py-hpp-fcl-18.04 #133935
allowed to fail

00:00:06

failed robotpkg-py-hpp-fcl-20.04 #133936
allowed to fail

00:00:11

canceled robotpkg-py-hpp-fcl-buster #133937
allowed to fail

00:00:13

canceled robotpkg-py-hpp-fcl-ferrum #133938
allowed to fail

00:00:12

 
Name Stage Failure
failed
robotpkg-py-hpp-fcl-20.04 Test
| fatal: clone of 'git://github.com/jrl-umi3218/jrl-cmakemodules.git' into submodule path '/root/robotpkg/path/hpp-fcl/work/hpp-fcl-1.7.5/cmake' failed
| Failed to clone 'cmake' a second time, aborting

For details or bug reports, check the complete log file in:
/root/robotpkg/path/hpp-fcl/work/extract.log
make: *** [/root/robotpkg/mk/extract/checkout.mk:226: do-checkout] Error 1
make: *** [/root/robotpkg/mk/internal/trusted.mk:36: checkout] Error 2
Cleaning up project directory and file based variables
ERROR: Job failed: exit code 1

failed
format Test
./test/scripts/geometric_shapes.py:46:40: E231 missing whitespace after ','
./test/scripts/geometric_shapes.py:46:42: E231 missing whitespace after ','
./test/scripts/geometric_shapes.py:46:45: E202 whitespace before ']'
./test/scripts/geometric_shapes.py:47:37: E231 missing whitespace after ','
./test/scripts/geometric_shapes.py:48:6: E201 whitespace after '('
./test/scripts/geometric_shapes.py:49:6: E201 whitespace after '('
./test/scripts/geometric_shapes.py:49:55: E202 whitespace before ']'
Cleaning up project directory and file based variables
ERROR: Job failed: exit code 1

failed
robotpkg-py-hpp-fcl-18.04 Test

For details or bug reports, check the complete log file in:
/root/robotpkg/path/hpp-fcl/work/extract.log
make: *** [do-checkout] Error 1
/root/robotpkg/mk/extract/checkout.mk:225: recipe for target 'do-checkout' failed
/root/robotpkg/mk/internal/trusted.mk:36: recipe for target 'checkout' failed
make: *** [checkout] Error 2
Cleaning up project directory and file based variables
ERROR: Job failed: exit code 1