ros: update version

12 jobs for v1.7.3 in 19 seconds (queued for 10 seconds)
latest
Status Name Job ID Coverage
  Test
canceled doc-coverage #133927

00:00:16

canceled format #133928
allowed to fail

00:00:16

canceled robotpkg-hpp-fcl-16.04 #133917
allowed to fail

00:00:19

failed robotpkg-hpp-fcl-18.04 #133918
allowed to fail

00:00:17

canceled robotpkg-hpp-fcl-20.04 #133919
allowed to fail

00:00:19

failed robotpkg-hpp-fcl-buster #133920
allowed to fail

00:00:06

canceled robotpkg-hpp-fcl-ferrum #133921
allowed to fail

00:00:18

canceled robotpkg-py-hpp-fcl-16.04 #133922
allowed to fail

00:00:18

failed robotpkg-py-hpp-fcl-18.04 #133923
allowed to fail

00:00:07

failed robotpkg-py-hpp-fcl-20.04 #133924
allowed to fail

00:00:16

canceled robotpkg-py-hpp-fcl-buster #133925
allowed to fail

00:00:17

canceled robotpkg-py-hpp-fcl-ferrum #133926
allowed to fail

00:00:16

 
Name Stage Failure
failed
robotpkg-py-hpp-fcl-20.04 Test
| fatal: clone of 'git://github.com/jrl-umi3218/jrl-cmakemodules.git' into submodule path '/root/robotpkg/path/hpp-fcl/work/hpp-fcl-1.7.5/cmake' failed
| Failed to clone 'cmake' a second time, aborting

For details or bug reports, check the complete log file in:
/root/robotpkg/path/hpp-fcl/work/extract.log
make: *** [/root/robotpkg/mk/extract/checkout.mk:226: do-checkout] Error 1
make: *** [/root/robotpkg/mk/internal/trusted.mk:36: checkout] Error 2
Cleaning up project directory and file based variables
ERROR: Job failed: exit code 1

failed
robotpkg-hpp-fcl-18.04 Test
For details or bug reports, check the complete log file in:
/root/robotpkg/path/hpp-fcl/work/extract.log

make: *** [do-checkout] Error 1
/root/robotpkg/mk/extract/checkout.mk:225: recipe for target 'do-checkout' failed
make: *** [checkout] Error 2
/root/robotpkg/mk/internal/trusted.mk:36: recipe for target 'checkout' failed
Cleaning up project directory and file based variables
ERROR: Job failed: exit code 1

failed
robotpkg-py-hpp-fcl-18.04 Test
For details or bug reports, check the complete log file in:
/root/robotpkg/path/hpp-fcl/work/extract.log

make: *** [do-checkout] Error 1
/root/robotpkg/mk/extract/checkout.mk:225: recipe for target 'do-checkout' failed
make: *** [checkout] Error 2
/root/robotpkg/mk/internal/trusted.mk:36: recipe for target 'checkout' failed
Cleaning up project directory and file based variables
ERROR: Job failed: exit code 1

failed
robotpkg-hpp-fcl-buster Test
| fatal: clone of 'git://github.com/qhull/qhull.git' into submodule path '/root/robotpkg/path/hpp-fcl/work/hpp-fcl-1.7.5/third-parties/qhull' failed
| Failed to clone 'third-parties/qhull' a second time, aborting
For details or bug reports, check the complete log file in:
/root/robotpkg/path/hpp-fcl/work/extract.log
make: *** [/root/robotpkg/mk/extract/checkout.mk:226: do-checkout] Error 1
make: *** [/root/robotpkg/mk/internal/trusted.mk:36: checkout] Error 2

Cleaning up project directory and file based variables
ERROR: Job failed: exit code 1