Merge pull request #244 from jcarpent/devel

Enhance Convex exposition
12 jobs for devel in 23 minutes and 2 seconds (queued for 5 seconds)
Status Name Job ID Coverage
  Test
passed doc-coverage #130352

00:23:00

77.0%
failed format #130353
allowed to fail

00:00:20

passed robotpkg-hpp-fcl-16.04 #130342

00:03:33

passed robotpkg-hpp-fcl-18.04 #130343

00:05:11

passed robotpkg-hpp-fcl-20.04 #130344

00:01:49

failed robotpkg-hpp-fcl-buster #130345
allowed to fail

00:03:21

passed robotpkg-hpp-fcl-ferrum #130346

00:05:58

passed robotpkg-py-hpp-fcl-16.04 #130347

00:04:36

passed robotpkg-py-hpp-fcl-18.04 #130348

00:05:41

passed robotpkg-py-hpp-fcl-20.04 #130349

00:02:40

failed robotpkg-py-hpp-fcl-buster #130350
allowed to fail

00:04:13

passed robotpkg-py-hpp-fcl-ferrum #130351

00:04:00

 
Name Stage Failure
failed
robotpkg-py-hpp-fcl-buster Test
95% tests passed, 1 tests failed out of 21

Total Test time (real) = 64.96 sec

The following tests FAILED:
16 - gjk (Child aborted)
Errors while running CTest
make: *** [Makefile:110: test] Error 8
Cleaning up file based variables
ERROR: Job failed: exit code 1
failed
robotpkg-hpp-fcl-buster Test
89% tests passed, 2 tests failed out of 18

Total Test time (real) = 67.17 sec

The following tests FAILED:
16 - gjk (Child aborted)
18 - serialization (Child aborted)
make: *** [Makefile:110: test] Error 8
Cleaning up file based variables
ERROR: Job failed: exit code 1
failed
format Test
./test/scripts/geometric_shapes.py:46:38: E231 missing whitespace after ','
./test/scripts/geometric_shapes.py:46:40: E231 missing whitespace after ','
./test/scripts/geometric_shapes.py:46:42: E231 missing whitespace after ','
./test/scripts/geometric_shapes.py:46:45: E202 whitespace before ']'
./test/scripts/geometric_shapes.py:47:37: E231 missing whitespace after ','
./test/scripts/geometric_shapes.py:48:6: E201 whitespace after '('
./test/scripts/geometric_shapes.py:49:6: E201 whitespace after '('
./test/scripts/geometric_shapes.py:49:55: E202 whitespace before ']'
Cleaning up file based variables
ERROR: Job failed: exit code 1