ros: update version

9 jobs for v1.2.1 in 9 minutes and 41 seconds (queued for 7 minutes and 34 seconds)
latest
Status Name Job ID Coverage
  Test
canceled doc-coverage #115660

00:05:32

failed format #115661
allowed to fail

00:00:33

canceled robotpkg-hpp-fcl-18.04-release #115653

00:09:41

failed robotpkg-py-hpp-fcl-py2-18.04-release #115655

00:08:08

canceled robotpkg-py-hpp-fcl-py3-16.04-release #115654
allowed to fail

00:09:38

failed robotpkg-py-hpp-fcl-py3-18.04-release #115656
allowed to fail

00:08:12

canceled robotpkg-py-hpp-fcl-py3-20.04-release #115657

00:08:48

failed robotpkg-py-hpp-fcl-py3-buster-release #115658
allowed to fail

00:08:05

canceled robotpkg-py-hpp-fcl-py3-stretch-release #115659
allowed to fail

00:07:38

 
Name Stage Failure
failed
robotpkg-py-hpp-fcl-py3-buster-release Test
ERROR: found:	/opt/openrobots/include/hpp/fcl/config.hh, wrong version 1.2.1
ERROR: missing: /opt/openrobots/include/hpp/fcl/config.hh
ERROR:
ERROR: Please reinstall the package in ../../path/hpp-fcl
ERROR: ======================================================================
make: *** [/root/robotpkg/mk/depends/depends.mk:70: do-depends] Error 1
make: *** [/root/robotpkg/mk/internal/trusted.mk:36: install] Error 2
Cleaning up file based variables
ERROR: Job failed: exit code 1
failed
robotpkg-py-hpp-fcl-py3-18.04-release Test
ERROR: 
ERROR: Please reinstall the package in ../../path/hpp-fcl
ERROR: ======================================================================
/root/robotpkg/mk/depends/depends.mk:70: recipe for target 'do-depends' failed
make: *** [do-depends] Error 1
/root/robotpkg/mk/internal/trusted.mk:36: recipe for target 'install' failed
make: *** [install] Error 2
Cleaning up file based variables
ERROR: Job failed: exit code 1
failed
robotpkg-py-hpp-fcl-py2-18.04-release Test
ERROR: 
ERROR: Please reinstall the package in ../../path/hpp-fcl
ERROR: ======================================================================
make: *** [do-depends] Error 1
/root/robotpkg/mk/depends/depends.mk:70: recipe for target 'do-depends' failed
/root/robotpkg/mk/internal/trusted.mk:36: recipe for target 'install' failed
make: *** [install] Error 2
Cleaning up file based variables
ERROR: Job failed: exit code 1
failed
format Test
-}
+} // namespace fcl

-} // namespace hpp
+} // namespace hpp

#endif
Cleaning up file based variables
ERROR: Job failed: exit code 1