cmake: sync submodule

9 jobs for pr/197 in 16 minutes and 53 seconds (queued for 1 second)
latest
Status Name Job ID Coverage
  Test
failed doc-coverage #94666

00:04:00

failed format #94667
allowed to fail

00:00:31

failed robotpkg-hpp-fcl-18.04-release #94659

00:03:11

failed robotpkg-py-hpp-fcl-py2-18.04-release #94661

00:00:53

failed robotpkg-py-hpp-fcl-py3-16.04-release #94660
allowed to fail

00:06:49

failed robotpkg-py-hpp-fcl-py3-18.04-release #94662
allowed to fail

00:00:55

failed robotpkg-py-hpp-fcl-py3-20.04-release #94663

00:16:52

failed robotpkg-py-hpp-fcl-py3-buster-release #94664
allowed to fail

00:08:53

failed robotpkg-py-hpp-fcl-py3-stretch-release #94665
allowed to fail

00:07:06

 
Name Stage Failure
failed
doc-coverage Test
Running after script...
$ cd /root/robotpkg/path/py-hpp-fcl
$ build=$(make show-var VARNAME=CONFIGURE_DIRS); cd $(make show-var VARNAME=WRKSRC); cd $build
$ make doc
make: Nothing to be done for 'doc'.
$ mv doc/doxygen-html ${CI_PROJECT_DIR}
mv: cannot stat 'doc/doxygen-html': No such file or directory
Cleaning up file based variables
ERROR: Job failed: exit code 1
failed
robotpkg-py-hpp-fcl-py3-stretch-release Test
/root/robotpkg/path/hpp-fcl/work.runner-ke6dzkhd-project-88-concurrent-0/build.log
make[1]: *** [do-build] Error 2
/root/robotpkg/mk/build/build.mk:198: recipe for target 'do-build' failed
make: *** [do-depends] Error 1
/root/robotpkg/mk/depends/depends.mk:70: recipe for target 'do-depends' failed
/root/robotpkg/mk/internal/trusted.mk:36: recipe for target 'install' failed
make: *** [install] Error 2
Cleaning up file based variables
ERROR: Job failed: exit code 1
failed
robotpkg-py-hpp-fcl-py2-18.04-release Test
/root/robotpkg/path/hpp-fcl/work.runner-zuwchyoo-project-88-concurrent-2/build.log
/root/robotpkg/mk/build/build.mk:198: recipe for target 'do-build' failed
make[1]: *** [do-build] Error 2
/root/robotpkg/mk/depends/depends.mk:70: recipe for target 'do-depends' failed
make: *** [do-depends] Error 1
make: *** [install] Error 2
/root/robotpkg/mk/internal/trusted.mk:36: recipe for target 'install' failed
Cleaning up file based variables
ERROR: Job failed: exit code 1
failed
format Test
-}
+} // namespace fcl

-} // namespace hpp
+} // namespace hpp

#endif
Cleaning up file based variables
ERROR: Job failed: exit code 1
failed
robotpkg-py-hpp-fcl-py3-16.04-release Test
make[1]: *** [do-build] Error 2
/root/robotpkg/mk/build/build.mk:198: recipe for target 'do-build' failed
/root/robotpkg/mk/depends/depends.mk:70: recipe for target 'do-depends' failed
make: *** [do-depends] Error 1
/root/robotpkg/mk/internal/trusted.mk:36: recipe for target 'install' failed
make: *** [install] Error 2
Running after_script
Uploading artifacts for failed job
ERROR: Job failed: exit code 1
failed
robotpkg-py-hpp-fcl-py3-buster-release Test

For details or bug reports, check the complete log file in:
/root/robotpkg/path/hpp-fcl/work.runner-qtz7nxce-project-88-concurrent-1/build.log
make[1]: *** [/root/robotpkg/mk/build/build.mk:199: do-build] Error 2
make: *** [/root/robotpkg/mk/depends/depends.mk:70: do-depends] Error 1
make: *** [/root/robotpkg/mk/internal/trusted.mk:36: install] Error 2
Running after_script
Uploading artifacts for failed job
ERROR: Job failed: exit code 1
failed
robotpkg-py-hpp-fcl-py3-20.04-release Test
| make[1]: Leaving directory '/root/robotpkg/path/hpp-fcl/work.runner-5nsakv6-project-88-concurrent-0/hpp-fcl-1.5.4'
| make: *** [Makefile:178: doc] Error 2
For details or bug reports, check the complete log file in:
/root/robotpkg/path/hpp-fcl/work.runner-5nsakv6-project-88-concurrent-0/build.log

make[1]: *** [/root/robotpkg/mk/build/build.mk:199: do-build] Error 2
make: *** [/root/robotpkg/mk/depends/depends.mk:70: do-depends] Error 1
make: *** [/root/robotpkg/mk/internal/trusted.mk:36: install] Error 2
ERROR: Job failed: exit code 1
failed
robotpkg-py-hpp-fcl-py3-18.04-release Test

make[1]: *** [do-build] Error 2
/root/robotpkg/mk/build/build.mk:198: recipe for target 'do-build' failed
/root/robotpkg/mk/depends/depends.mk:70: recipe for target 'do-depends' failed
make: *** [do-depends] Error 1
/root/robotpkg/mk/internal/trusted.mk:36: recipe for target 'install' failed
make: *** [install] Error 2
Cleaning up file based variables
ERROR: Job failed: exit code 1
failed
robotpkg-hpp-fcl-18.04-release Test

For details or bug reports, check the complete log file in:
/root/robotpkg/path/hpp-fcl/work.runner-zuwchyoo-project-88-concurrent-1/build.log
/root/robotpkg/mk/build/build.mk:198: recipe for target 'do-build' failed
make: *** [do-build] Error 2
/root/robotpkg/mk/internal/trusted.mk:36: recipe for target 'install' failed
make: *** [install] Error 2
Cleaning up file based variables
ERROR: Job failed: exit code 1