cmake: remove useless line

9 jobs for devel in 88 minutes and 7 seconds (queued for 1 second)
Status Name Job ID Coverage
  Test
passed doc-coverage #91243

01:28:05

77.0%
failed format #91244
allowed to fail

00:01:25

passed robotpkg-hpp-fcl-18.04-release #91236

00:11:38

passed robotpkg-py-hpp-fcl-py2-18.04-release #91238

00:32:16

failed robotpkg-py-hpp-fcl-py3-16.04-release #91237
allowed to fail

00:01:36

passed robotpkg-py-hpp-fcl-py3-18.04-release #91239

00:21:58

passed robotpkg-py-hpp-fcl-py3-20.04-release #91240

00:41:07

failed robotpkg-py-hpp-fcl-py3-buster-release #91241

00:22:16

failed robotpkg-py-hpp-fcl-py3-stretch-release #91242
allowed to fail

00:01:24

 
Name Stage Failure
failed
robotpkg-py-hpp-fcl-py3-buster-release Test
95% tests passed, 1 tests failed out of 19

Total Test time (real) = 147.12 sec

The following tests FAILED:
16 - gjk (Child aborted)
Errors while running CTest
make: *** [Makefile:110: test] Error 8
ERROR: Job failed: exit code 1
failed
format Test
 
-}
+} // namespace fcl

-} // namespace hpp
+} // namespace hpp

#endif
ERROR: Job failed: exit code 1
failed
robotpkg-py-hpp-fcl-py3-16.04-release Test
For details or bug reports, check the complete log file in:
/root/robotpkg/path/hpp-fcl/work.runner-swwlejyc-project-88-concurrent-2/configure.log
/root/robotpkg/mk/configure/cmake-configure.mk:100: recipe for target 'do-configure-cmake' failed
make[1]: *** [do-configure-cmake] Error 1
make: *** [do-depends] Error 1
/root/robotpkg/mk/depends/depends.mk:70: recipe for target 'do-depends' failed
/root/robotpkg/mk/internal/trusted.mk:36: recipe for target 'install' failed
make: *** [install] Error 2
ERROR: Job failed: exit code 1
failed
robotpkg-py-hpp-fcl-py3-stretch-release Test
/root/robotpkg/mk/build/build.mk:198: recipe for target 'do-build' failed
make[1]: *** [do-build] Error 2
/root/robotpkg/mk/depends/depends.mk:70: recipe for target 'do-depends' failed
make: *** [do-depends] Error 1
/root/robotpkg/mk/internal/trusted.mk:36: recipe for target 'install' failed
make: *** [install] Error 2
Running after_script
Uploading artifacts for failed job
ERROR: Job failed: exit code 1