release: Update package.xml version to 4.12.0

6 jobs for master in 32 seconds (queued for 1 second)
Name Stage Failure
failed
robotpkg-hpp-core-ferrum Test
For details or bug reports, check the complete log file in:
/root/robotpkg/path/hpp-core/work/extract.log

/root/robotpkg/mk/extract/checkout.mk:225: recipe for target 'do-checkout' failed
make: *** [do-checkout] Error 1
make: *** [checkout] Error 2
/root/robotpkg/mk/internal/trusted.mk:36: recipe for target 'checkout' failed
Cleaning up project directory and file based variables
ERROR: Job failed: exit code 1

failed
robotpkg-hpp-core-18.04 Test
For details or bug reports, check the complete log file in:
/root/robotpkg/path/hpp-core/work/extract.log

/root/robotpkg/mk/extract/checkout.mk:225: recipe for target 'do-checkout' failed
make: *** [do-checkout] Error 1
/root/robotpkg/mk/internal/trusted.mk:36: recipe for target 'checkout' failed
make: *** [checkout] Error 2
Cleaning up project directory and file based variables
ERROR: Job failed: exit code 1

failed
format Test
+ true
+ find . -path ./cmake -prune -o -iregex '.*\.\(h\|c\|hh\|cc\|hpp\|cpp\|hxx\|cxx\)$' -exec clang-format --style=Google -i '{}' +
+ true
+ flake8 .
+ false
+ yapf -ri .
yapf: input filenames did not match any python files
Cleaning up project directory and file based variables
ERROR: Job failed: exit code 1

failed
doc-coverage Test
Running after script...
$ cd /root/robotpkg/path/hpp-core
$ build=$(make show-var VARNAME=CONFIGURE_DIRS); cd $(make show-var VARNAME=WRKSRC); cd $build
$ make doc
make: Nothing to be done for 'doc'.
$ mv doc/doxygen-html ${CI_PROJECT_DIR}
mv: cannot stat 'doc/doxygen-html': No such file or directory
Cleaning up project directory and file based variables
ERROR: Job failed: exit code 1

failed
robotpkg-hpp-core-buster Test
| fatal: clone of 'git://github.com/jrl-umi3218/jrl-cmakemodules.git' into submodule path '/root/robotpkg/path/hpp-core/work/hpp-core-4.12.0/cmake' failed
| Failed to clone 'cmake' a second time, aborting

For details or bug reports, check the complete log file in:
/root/robotpkg/path/hpp-core/work/extract.log
make: *** [/root/robotpkg/mk/extract/checkout.mk:226: do-checkout] Error 1
make: *** [/root/robotpkg/mk/internal/trusted.mk:36: checkout] Error 2
Cleaning up project directory and file based variables
ERROR: Job failed: exit code 1

failed
robotpkg-hpp-core-20.04 Test
| fatal: clone of 'git://github.com/jrl-umi3218/jrl-cmakemodules.git' into submodule path '/root/robotpkg/path/hpp-core/work/hpp-core-4.12.0/cmake' failed
| Failed to clone 'cmake' a second time, aborting
For details or bug reports, check the complete log file in:
/root/robotpkg/path/hpp-core/work/extract.log

make: *** [/root/robotpkg/mk/extract/checkout.mk:226: do-checkout] Error 1
make: *** [/root/robotpkg/mk/internal/trusted.mk:36: checkout] Error 2
Cleaning up project directory and file based variables
ERROR: Job failed: exit code 1