[PathValidation] method validate takes a PathConstPtr_t as input.

6 jobs for pr/270 in 2 minutes and 4 seconds (queued for 1 second)
Name Stage Failure
failed
robotpkg-hpp-core-ferrum Test

For details or bug reports, check the complete log file in:
/root/robotpkg/path/hpp-core/work/build.log
/root/robotpkg/mk/build/build.mk:198: recipe for target 'do-build' failed
make: *** [do-build] Error 2
/root/robotpkg/mk/internal/trusted.mk:36: recipe for target 'install' failed
make: *** [install] Error 2
Cleaning up project directory and file based variables
ERROR: Job failed: exit code 1

failed
robotpkg-hpp-core-20.04 Test
| make[1]: *** [CMakeFiles/Makefile2:252: CMakeFiles/hpp-core.dir/all] Error 2
| make: *** [Makefile:144: all] Error 2
For details or bug reports, check the complete log file in:
/root/robotpkg/path/hpp-core/work/build.log

make: *** [/root/robotpkg/mk/build/build.mk:199: do-build] Error 2
make: *** [/root/robotpkg/mk/internal/trusted.mk:36: install] Error 2
Cleaning up project directory and file based variables
ERROR: Job failed: exit code 1

failed
robotpkg-hpp-core-18.04 Test

/root/robotpkg/mk/build/build.mk:198: recipe for target 'do-build' failed
For details or bug reports, check the complete log file in:
/root/robotpkg/path/hpp-core/work/build.log
make: *** [do-build] Error 2
make: *** [install] Error 2
/root/robotpkg/mk/internal/trusted.mk:36: recipe for target 'install' failed
Cleaning up project directory and file based variables
ERROR: Job failed: exit code 1

failed
doc-coverage Test
src/problem-target/task-target.cc             35       0     0%   45,47-50,53,55-56,58,62,64-71,74,77,79-80,82,85,87-89,91-92,94-97,100-101
src/problem.cc 136 0 0% 51,53-54,59,63-65,70,72,77,79-81,86,88-90,93,95-97,101-102,108,110,112-116,121,124,126,130,136,138,143,146-149,151,156,159-160,163-165,167,172,175-176,179-181,183,188,190,195,197,202,204,209,211,213-215,221,224,227-231,237,241-245,251,253-254,258-262,268,271-275,281,283,288,290,295,297,302,304-305,307,310-311,313,317-321,325-329,334-342,346-350,357,359-362
src/reeds-shepp-path.cc 313 0 0% 55-56,98,101-103,106,108-111,118,120-121,123,125-128,132,134-135,137-138,140-143,146,149,152-154,157-164,166,169,172-175,179,182-183,185-186,188,190-191,193,195-196,198,200-201,203,205-206,208,210-211,213,215-216,218-219,222,224-226,228-234,236,238,241-242,244-245,247,249-250,252,254-255,257,259-260,264-265,267,269-270,272,274-275,277,279-280,282-283,286,288-289,291-296,298,301,303-304,306-307,309-313,316,319,322-323,325-326,328,330-331,333,335-336,338,340-341,344,346-347,349,351-352,354,356-357,359-360,363,365-367,369-376,378,381,383-385,387-393,395,397,400-401,403-404,406,408-409,411,413-414,416,418-419,422,424-425,427,429-430,432,434-435,437,439-440,444-445,449,451-452,454,456-457,459,461-462,464,466-467,470,472-473,475,477-478,480,482-483,485-486,489,491-493,495-496,498-503,506,508,511-512,514-515,517,519-520,522,524-525,527-528,544,550-554,558-559,562-564,566-567,569,571-572,574,580-581,583,585-589,591-596,598-608,610,612-613,617-618,620-622,626,628,632,634
------------------------------------------------------------------------------
TOTAL 6960 0 0%
------------------------------------------------------------------------------
$ gcovr -e CMakeFiles -e _deps -r . --html --html-details -o ${CI_PROJECT_DIR}/coverage/index.html
Cleaning up project directory and file based variables
ERROR: Job failed: exit code 1

failed
robotpkg-hpp-core-buster Test
| make[1]: Leaving directory '/root/robotpkg/path/hpp-core/work/hpp-core-4.12.0'
| make: *** [Makefile:144: all] Error 2

For details or bug reports, check the complete log file in:
/root/robotpkg/path/hpp-core/work/build.log
make: *** [/root/robotpkg/mk/build/build.mk:199: do-build] Error 2
make: *** [/root/robotpkg/mk/internal/trusted.mk:36: install] Error 2
Cleaning up project directory and file based variables
ERROR: Job failed: exit code 1

failed
format Test
+ true
+ find . -path ./cmake -prune -o -iregex '.*\.\(h\|c\|hh\|cc\|hpp\|cpp\|hxx\|cxx\)$' -exec clang-format --style=Google -i '{}' +
+ true
+ flake8 .
+ false
+ yapf -ri .
yapf: input filenames did not match any python files
Cleaning up project directory and file based variables
ERROR: Job failed: exit code 1