v4.10.1

7 jobs for master in 37 minutes and 6 seconds (queued for 1 second)
Status Name Job ID Coverage
  Test
passed doc-coverage #104850

00:17:37

62.0%
failed format #104851
allowed to fail

00:02:13

failed robotpkg-hpp-core-16.04-release #104845

00:25:10

passed robotpkg-hpp-core-18.04-release #104846

00:28:01

passed robotpkg-hpp-core-20.04-release #104847

00:37:05

failed robotpkg-hpp-core-buster-release #104848

00:13:14

passed robotpkg-hpp-core-stretch-release #104849

00:33:48

 
Name Stage Failure
failed
format Test
-  LocalPathPtr_t p3 (LocalPath::create (inter3));
- pv->appendPath (p0);
- pv->appendPath (p1);
- pv->appendPath (p2);
- pv->appendPath (p3);
-
-
- value_type tmin (3.7487655421722721), tmax (4.0792129048147352);
- PathPtr_t ext
ERROR: Job failed: exit code 1
failed
robotpkg-hpp-core-16.04-release Test

Total Test time (real) = 3.17 sec

The following tests FAILED:
1 - roadmap-1 (Failed)
Errors while running CTest
Makefile:85: recipe for target 'test' failed
make: *** [test] Error 8
ERROR: Job failed: exit code 1
failed
robotpkg-hpp-core-buster-release Test

Total Test time (real) = 1.17 sec

The following tests FAILED:
14 - spline-path (Child aborted)
Errors while running CTest
make: *** [Makefile:110: test] Error 8
Cleaning up file based variables
ERROR: Job failed: exit code 1