using std::isfinite

7 jobs for master in 20 minutes and 18 seconds (queued for 2 seconds)
Status Name Job ID Coverage
  Test
passed doc-coverage #90829

00:20:16

62.0%
failed format #90830
allowed to fail

00:00:16

passed robotpkg-hpp-core-16.04-release #90824

00:12:36

passed robotpkg-hpp-core-18.04-release #90825

00:11:55

passed robotpkg-hpp-core-20.04-release #90826

00:18:54

failed robotpkg-hpp-core-buster-release #90827

00:15:00

failed robotpkg-hpp-core-stretch-release #90828

00:13:34

 
Name Stage Failure
failed
robotpkg-hpp-core-buster-release Test

The following tests FAILED:
3 - test-solid-solid-collision (Child aborted)
14 - spline-path (Child aborted)
Errors while running CTest
make: *** [Makefile:110: test] Error 8
Running after_script
Uploading artifacts for failed job
ERROR: Job failed: exit code 1
failed
robotpkg-hpp-core-stretch-release Test
	 15 - problem (OTHER_FAULT)
16 - time-parameterization (OTHER_FAULT)
17 - configuration-shooters (OTHER_FAULT)
18 - test-kinodynamic (OTHER_FAULT)
19 - plugin (OTHER_FAULT)
Errors while running CTest
make: *** [test] Error 8
Makefile:85: recipe for target 'test' failed
ERROR: Job failed: exit code 1
failed
format Test
-	/// Solve problem constraints and collision constraints
- ///
- /// \retval x path that satisfies the constraints as a vector,
- /// \retval path path that satisfies the constraints (same as x)
- /// \param collisionConstraints vector of collision constraints
- ///
- /// While constraints are not satisfi
Running after_script
Uploading artifacts for failed job
ERROR: Job failed: exit code 1