v1.3.0

30 jobs for v1.3.0 in 2 minutes and 48 seconds (queued for 22 seconds)
latest
Status Name Job ID Coverage
  Test
failed doc-coverage #80520

00:00:09

failed format #80452
allowed to fail

00:00:24

failed robotpkg-py-tsid-16.04-debug #80390
allowed to fail

00:00:31

failed robotpkg-py-tsid-16.04-release #80514
allowed to fail

00:00:09

failed robotpkg-py-tsid-18.04-debug #80435
allowed to fail

00:00:34

failed robotpkg-py-tsid-18.04-release #80393
allowed to fail

00:00:34

failed robotpkg-py-tsid-py3-16.04-debug #80392
allowed to fail

00:00:32

failed robotpkg-py-tsid-py3-16.04-release #80515
allowed to fail

00:00:09

failed robotpkg-py-tsid-py3-18.04-debug #80516

00:00:49

failed robotpkg-py-tsid-py3-18.04-release #80395

00:00:36

failed robotpkg-tsid-16.04-debug #80446

00:00:28

failed robotpkg-tsid-16.04-release #80517

00:00:27

failed robotpkg-tsid-18.04-debug #80548

00:01:04

failed robotpkg-tsid-18.04-release #80448

00:00:28

failed doc-coverage #80451

00:00:09

failed doc-coverage #80401

00:00:09

failed format #80402
allowed to fail

00:00:09

failed robotpkg-py-tsid-16.04-release #80430
allowed to fail

00:00:11

failed robotpkg-py-tsid-16.04-release #80389
allowed to fail

00:00:09

failed robotpkg-py-tsid-18.04-debug #80394
allowed to fail

00:00:09

failed robotpkg-py-tsid-py3-16.04-release #80433
allowed to fail

00:00:10

failed robotpkg-py-tsid-py3-16.04-release #80391
allowed to fail

00:00:09

failed robotpkg-py-tsid-py3-18.04-debug #80444

00:00:10

failed robotpkg-py-tsid-py3-18.04-debug #80396

00:00:09

failed robotpkg-tsid-16.04-debug #80398

00:00:09

failed robotpkg-tsid-16.04-release #80445

00:00:09

failed robotpkg-tsid-16.04-release #80397

00:00:09

failed robotpkg-tsid-18.04-debug #80450

00:01:06

failed robotpkg-tsid-18.04-debug #80400

00:00:09

failed robotpkg-tsid-18.04-release #80399

00:00:09

 
Name Stage Failure
failed
robotpkg-tsid-16.04-release Test
/root/robotpkg/optimization/tsid/work.runner-ke6dzkhd-project-187-concurrent-2/configure.log
make: *** [do-configure-cmake] Error 1
make: *** [install] Error 2

/root/robotpkg/mk/configure/cmake-configure.mk:100: recipe for target 'do-configure-cmake' failed
/root/robotpkg/mk/internal/trusted.mk:36: recipe for target 'install' failed
Running after_script
Uploading artifacts for failed job
ERROR: Job failed: exit code 1
failed
robotpkg-tsid-18.04-debug Test There has been a runner system failure, please try again
Using Docker executor with image memmos.laas.fr:5000/stack-of-tasks/tsid/tsid:18.04 ...
Pulling docker image memmos.laas.fr:5000/stack-of-tasks/tsid/tsid:18.04 ...
ERROR: Preparation failed: Error response from daemon: Get https://memmos.laas.fr:5000/v2/: net/http: request canceled while waiting for connection (Client.Timeout exceeded while awaiting headers) (docker.go:198:15s)
Will be retried in 3s ...
Using Docker executor with image memmos.laas.fr:5000/stack-of-tasks/tsid/tsid:18.04 ...
Pulling docker image memmos.laas.fr:5000/stack-of-tasks/tsid/tsid:18.04 ...
ERROR: Preparation failed: Error response from daemon: Get https://memmos.laas.fr:5000/v2/: net/http: request canceled while waiting for connection (Client.Timeout exceeded while awaiting headers) (docker.go:198:15s)
Will be retried in 3s ...
ERROR: Job failed (system failure): Error response from daemon: Get https://memmos.laas.fr:5000/v2/: net/http: request canceled while waiting for connection (Client.Timeout exceeded while awaiting headers) (docker.go:198:15s)
failed
robotpkg-py-tsid-18.04-debug Test

/root/robotpkg/mk/configure/cmake-configure.mk:100: recipe for target 'do-configure-cmake' failed
/root/robotpkg/mk/depends/depends.mk:70: recipe for target 'do-depends' failed
make: *** [do-depends] Error 1
/root/robotpkg/mk/internal/trusted.mk:36: recipe for target 'install' failed
make: *** [install] Error 2
Running after_script
Uploading artifacts for failed job
ERROR: Job failed: exit code 1
failed
robotpkg-tsid-18.04-release Test
/root/robotpkg/optimization/tsid/work.runner-ke6dzkhd-project-187-concurrent-1/configure.log
make: *** [do-configure-cmake] Error 1
make: *** [install] Error 2

/root/robotpkg/mk/configure/cmake-configure.mk:100: recipe for target 'do-configure-cmake' failed
/root/robotpkg/mk/internal/trusted.mk:36: recipe for target 'install' failed
Running after_script
Uploading artifacts for failed job
ERROR: Job failed: exit code 1
failed
doc-coverage Test There has been a runner system failure, please try again
ERROR: Preparation failed: Cannot connect to the Docker daemon at unix:///var/run/docker.sock. Is the docker daemon running? (docker.go:989:0s)
Will be retried in 3s ...
ERROR: Removing network for build
ERROR: Preparation failed: Cannot connect to the Docker daemon at unix:///var/run/docker.sock. Is the docker daemon running? (docker.go:989:0s)
Will be retried in 3s ...
ERROR: Removing network for build
ERROR: Preparation failed: Cannot connect to the Docker daemon at unix:///var/run/docker.sock. Is the docker daemon running? (docker.go:989:0s)
Will be retried in 3s ...
ERROR: Job failed (system failure): Cannot connect to the Docker daemon at unix:///var/run/docker.sock. Is the docker daemon running? (docker.go:989:0s)
failed
robotpkg-py-tsid-16.04-release Test There has been a runner system failure, please try again
ERROR: Preparation failed: Cannot connect to the Docker daemon at unix:///var/run/docker.sock. Is the docker daemon running? (docker.go:989:0s)
Will be retried in 3s ...
ERROR: Removing network for build
ERROR: Preparation failed: Cannot connect to the Docker daemon at unix:///var/run/docker.sock. Is the docker daemon running? (docker.go:989:0s)
Will be retried in 3s ...
ERROR: Removing network for build
ERROR: Preparation failed: Cannot connect to the Docker daemon at unix:///var/run/docker.sock. Is the docker daemon running? (docker.go:989:0s)
Will be retried in 3s ...
ERROR: Job failed (system failure): Cannot connect to the Docker daemon at unix:///var/run/docker.sock. Is the docker daemon running? (docker.go:989:0s)
failed
robotpkg-py-tsid-py3-16.04-release Test There has been a runner system failure, please try again
ERROR: Preparation failed: Cannot connect to the Docker daemon at unix:///var/run/docker.sock. Is the docker daemon running? (docker.go:989:0s)
Will be retried in 3s ...
ERROR: Removing network for build
ERROR: Preparation failed: Cannot connect to the Docker daemon at unix:///var/run/docker.sock. Is the docker daemon running? (docker.go:989:0s)
Will be retried in 3s ...
ERROR: Removing network for build
ERROR: Preparation failed: Cannot connect to the Docker daemon at unix:///var/run/docker.sock. Is the docker daemon running? (docker.go:989:0s)
Will be retried in 3s ...
ERROR: Job failed (system failure): Cannot connect to the Docker daemon at unix:///var/run/docker.sock. Is the docker daemon running? (docker.go:989:0s)
failed
robotpkg-py-tsid-py3-18.04-debug Test
/root/robotpkg/mk/configure/cmake-configure.mk:100: recipe for target 'do-configure-cmake' failed
make[1]: *** [do-configure-cmake] Error 1
make: *** [do-depends] Error 1
make: *** [install] Error 2
/root/robotpkg/mk/depends/depends.mk:70: recipe for target 'do-depends' failed
/root/robotpkg/mk/internal/trusted.mk:36: recipe for target 'install' failed
Running after_script
Uploading artifacts for failed job
ERROR: Job failed: exit code 1
failed
robotpkg-py-tsid-py3-18.04-release Test
/root/robotpkg/mk/configure/cmake-configure.mk:100: recipe for target 'do-configure-cmake' failed
make[1]: *** [do-configure-cmake] Error 1
/root/robotpkg/mk/depends/depends.mk:70: recipe for target 'do-depends' failed
make: *** [do-depends] Error 1
/root/robotpkg/mk/internal/trusted.mk:36: recipe for target 'install' failed
make: *** [install] Error 2
Running after_script
Uploading artifacts for failed job
ERROR: Job failed: exit code 1
failed
format Test
-      bool isBound() const;
+ bool isEquality() const;
+ bool isInequality() const;
+ bool isBound() const;

- const Vector & vector() const;
- const Vector & lowerBound() cons
Running after_script
Uploading artifacts for failed job
ERROR: Job failed: exit code 1
failed
robotpkg-tsid-16.04-debug Test
For details or bug reports, check the complete log file in:
/root/robotpkg/optimization/tsid/work.runner-ke6dzkhd-project-187-concurrent-3/configure.log
/root/robotpkg/mk/configure/cmake-configure.mk:100: recipe for target 'do-configure-cmake' failed
make: *** [do-configure-cmake] Error 1
/root/robotpkg/mk/internal/trusted.mk:36: recipe for target 'install' failed
make: *** [install] Error 2
Running after_script
Uploading artifacts for failed job
ERROR: Job failed: exit code 1
failed
robotpkg-py-tsid-18.04-release Test
/root/robotpkg/mk/configure/cmake-configure.mk:100: recipe for target 'do-configure-cmake' failed
make[1]: *** [do-configure-cmake] Error 1
make: *** [do-depends] Error 1
/root/robotpkg/mk/depends/depends.mk:70: recipe for target 'do-depends' failed
make: *** [install] Error 2
/root/robotpkg/mk/internal/trusted.mk:36: recipe for target 'install' failed
Running after_script
Uploading artifacts for failed job
ERROR: Job failed: exit code 1
failed
robotpkg-py-tsid-py3-16.04-debug Test
/root/robotpkg/optimization/tsid/work.runner-qtz7nxce-project-187-concurrent-1/configure.log
make[1]: *** [do-configure-cmake] Error 1
/root/robotpkg/mk/depends/depends.mk:70: recipe for target 'do-depends' failed
/root/robotpkg/mk/internal/trusted.mk:36: recipe for target 'install' failed
make: *** [do-depends] Error 1
make: *** [install] Error 2
Running after_script
Uploading artifacts for failed job
ERROR: Job failed: exit code 1
failed
robotpkg-py-tsid-16.04-debug Test

/root/robotpkg/mk/configure/cmake-configure.mk:100: recipe for target 'do-configure-cmake' failed
make: *** [do-depends] Error 1
/root/robotpkg/mk/depends/depends.mk:70: recipe for target 'do-depends' failed
/root/robotpkg/mk/internal/trusted.mk:36: recipe for target 'install' failed
make: *** [install] Error 2
Running after_script
Uploading artifacts for failed job
ERROR: Job failed: exit code 1