[CMake] keep the python module as a folder for now

ref
https://github.com/stack-of-tasks/tsid/pull/72#issuecomment-597082552
27 jobs for v1.2.3 in 50 minutes and 49 seconds (queued for 10 minutes and 45 seconds)
latest
Status Name Job ID Coverage
  Test
passed doc-coverage #72074

00:49:53

failed format #72140
allowed to fail

00:00:01

failed robotpkg-py-tsid-16.04-debug #72087
allowed to fail

00:07:33

failed robotpkg-py-tsid-16.04-release #72085
allowed to fail

00:32:25

failed robotpkg-py-tsid-18.04-debug #72128
allowed to fail

00:06:51

passed robotpkg-py-tsid-18.04-release #72162

00:08:54

failed robotpkg-py-tsid-py3-16.04-debug #72089
allowed to fail

00:07:34

failed robotpkg-py-tsid-py3-16.04-release #72160
allowed to fail

00:02:00

passed robotpkg-py-tsid-py3-18.04-debug #72095

00:36:51

passed robotpkg-py-tsid-py3-18.04-release #72093

00:09:15

passed robotpkg-tsid-16.04-debug #72070

00:23:04

passed robotpkg-tsid-16.04-release #72071

00:02:41

passed robotpkg-tsid-18.04-debug #72073

00:04:31

passed robotpkg-tsid-18.04-release #72072

00:03:34

failed format #72119
allowed to fail

00:00:01

failed format #72075
allowed to fail

00:06:47

failed robotpkg-py-tsid-16.04-debug #72063
allowed to fail

00:00:00

failed robotpkg-py-tsid-16.04-release #72062
allowed to fail

00:00:00

failed robotpkg-py-tsid-18.04-debug #72091
allowed to fail

00:06:08

failed robotpkg-py-tsid-18.04-debug #72067
allowed to fail

00:00:00

failed robotpkg-py-tsid-18.04-release #72090
allowed to fail

00:12:10

failed robotpkg-py-tsid-18.04-release #72066
allowed to fail

00:00:00

failed robotpkg-py-tsid-py3-16.04-debug #72065
allowed to fail

00:00:00

failed robotpkg-py-tsid-py3-16.04-release #72088
allowed to fail

00:13:00

failed robotpkg-py-tsid-py3-16.04-release #72064
allowed to fail

00:00:00

failed robotpkg-py-tsid-py3-18.04-debug #72069
allowed to fail

00:00:00

failed robotpkg-py-tsid-py3-18.04-release #72068
allowed to fail

00:00:00

 
Name Stage Failure
failed
robotpkg-py-tsid-18.04-debug Test There has been a runner system failure, please try again

Skipping Git submodules setup
Restoring cache
Checking cache for default...
No URL provided, cache will not be downloaded from shared cache server. Instead a local version of cache will be extracted.

Successfully extracted cache
Downloading artifacts
Uploading artifacts for failed job
ERROR: Job failed (system failure): Cannot connect to the Docker daemon at unix:///var/run/docker.sock. Is the docker daemon running? (docker.go:787:120s)
failed
robotpkg-py-tsid-16.04-release Test
	  8 - py-Formulation (SEGFAULT)
9 - py-RobotWrapper (SEGFAULT)
10 - py-Tasks (SEGFAULT)
Errors while running CTest
make: *** [test] Error 8
Makefile:85: recipe for target 'test' failed
Running after_script
Uploading artifacts for failed job
ERROR: Job failed: exit code 1
failed
robotpkg-py-tsid-py3-16.04-debug Test
	  8 - py-Formulation (SEGFAULT)
9 - py-RobotWrapper (SEGFAULT)
10 - py-Tasks (SEGFAULT)
Errors while running CTest
Makefile:85: recipe for target 'test' failed
make: *** [test] Error 8
Running after_script
Uploading artifacts for failed job
ERROR: Job failed: exit code 1
failed
robotpkg-py-tsid-16.04-debug Test
	  8 - py-Formulation (SEGFAULT)
9 - py-RobotWrapper (SEGFAULT)
10 - py-Tasks (SEGFAULT)
Errors while running CTest
make: *** [test] Error 8
Makefile:85: recipe for target 'test' failed
Running after_script
Uploading artifacts for failed job
ERROR: Job failed: exit code 1
failed
robotpkg-py-tsid-py3-16.04-release Test There has been a runner system failure, please try again
Running with gitlab-runner 12.9.0 (4c96e5ad)
on raman 7gqkM7SY
Preparing the "docker" executor
Using Docker executor with image memmos.laas.fr:5000/stack-of-tasks/tsid/py-tsid-py3:16.04 ...
Pulling docker image memmos.laas.fr:5000/stack-of-tasks/tsid/py-tsid-py3:16.04 ...
Using docker image sha256:66591651372d969aa4bcb244414da7b54ad54d7900a37743970cae37d071821a for memmos.laas.fr:5000/stack-of-tasks/tsid/py-tsid-py3:16.04 ...
Preparing environment
Uploading artifacts for failed job
ERROR: Job failed (system failure): Cannot connect to the Docker daemon at unix:///var/run/docker.sock. Is the docker daemon running? (docker.go:787:120s)
failed
format Test There has been a runner system failure, please try again
Running with gitlab-runner 12.9.0 (4c96e5ad)
on raman 7gqkM7SY
Preparing the "docker" executor
Using Docker executor with image gepetto/linters ...
Pulling docker image gepetto/linters ...
Using docker image sha256:7d18877096946a27a7f5384ab15194ad10b7a65f52809f4540553d06bb59e1a1 for gepetto/linters ...
Preparing environment
Uploading artifacts for failed job
ERROR: Job failed (system failure): Error response from daemon: Conflict. The container name "/runner-7gqkM7SY-project-187-concurrent-9-predefined-0" is already in use by container "0a9b25b5079d9d2721f1e7f91bd2644a9c62543e47d7d74a6157c1c5ca578d84". You have to remove (or rename) that container to be able to reuse that name. (docker.go:787:0s)