define locally BOOST_BIND_GLOBAL_PLACEHOLDERS, fix #128

9 jobs for topic/128 in 15 minutes and 9 seconds (queued for 2 seconds)
latest
Status Name Job ID Coverage
  Test
passed doc-coverage #111336

00:15:07

failed format #111337
allowed to fail

00:00:18

passed robotpkg-py-tsid-py2-18.04-release #111330

00:08:47

passed robotpkg-py-tsid-py3-16.04-release #111329

00:10:22

failed robotpkg-py-tsid-py3-18.04-release #111331

00:04:31

passed robotpkg-py-tsid-py3-20.04-release #111332

00:11:39

failed robotpkg-py-tsid-py3-buster-release #111333
allowed to fail

00:04:32

passed robotpkg-py-tsid-py3-stretch-release #111334

00:10:16

passed robotpkg-tsid-18.04-release #111335

00:09:12

 
Name Stage Failure
failed
robotpkg-py-tsid-py3-buster-release Test
| make: *** [Makefile:144: all] Error 2

For details or bug reports, check the complete log file in:
/root/robotpkg/optimization/tsid/work.runner-swwlejyc-project-187-concurrent-2/build.log
make[1]: *** [/root/robotpkg/mk/build/build.mk:199: do-build] Error 2
make: *** [/root/robotpkg/mk/depends/depends.mk:70: do-depends] Error 1
make: *** [/root/robotpkg/mk/internal/trusted.mk:36: install] Error 2
Cleaning up file based variables
ERROR: Job failed: exit code 1
failed
robotpkg-py-tsid-py3-18.04-release Test

/root/robotpkg/mk/build/build.mk:198: recipe for target 'do-build' failed
make[1]: *** [do-build] Error 2
/root/robotpkg/mk/depends/depends.mk:70: recipe for target 'do-depends' failed
make: *** [do-depends] Error 1
/root/robotpkg/mk/internal/trusted.mk:36: recipe for target 'install' failed
make: *** [install] Error 2
Cleaning up file based variables
ERROR: Job failed: exit code 1
failed
format Test
   getProfiler().report_all(3, cout);
getStatistics().report_all(1, cout);
}

-
-BOOST_AUTO_TEST_SUITE_END ()
+BOOST_AUTO_TEST_SUITE_END()
Cleaning up file based variables
ERROR: Job failed: exit code 1