models: sync submodule

12 jobs for devel in 38 minutes and 15 seconds (queued for 8 seconds)
latest
Status Name Job ID Coverage
  Test
passed doc-coverage #134688

00:38:13

96.0%
failed format #134689
allowed to fail

00:00:13

failed robotpkg-pinocchio-16.04 #134678
allowed to fail

00:23:24

passed robotpkg-pinocchio-18.04 #134679

00:21:18

passed robotpkg-pinocchio-20.04 #134680

00:21:17

passed robotpkg-pinocchio-buster #134681

00:12:56

passed robotpkg-pinocchio-ferrum #134682

00:03:07

failed robotpkg-py-pinocchio-16.04 #134683
allowed to fail

00:01:08

passed robotpkg-py-pinocchio-18.04 #134684

00:28:34

passed robotpkg-py-pinocchio-20.04 #134685

00:06:37

passed robotpkg-py-pinocchio-buster #134686

00:32:03

passed robotpkg-py-pinocchio-ferrum #134687

00:05:37

 
Name Stage Failure
failed
robotpkg-pinocchio-16.04 Test

For details or bug reports, check the complete log file in:
/root/robotpkg/math/pinocchio/work/build.log
/root/robotpkg/mk/build/build.mk:198: recipe for target 'do-build' failed
make: *** [do-build] Error 2
/root/robotpkg/mk/internal/trusted.mk:36: recipe for target 'install' failed
make: *** [install] Error 2
Cleaning up project directory and file based variables
ERROR: Job failed: exit code 1

failed
robotpkg-py-pinocchio-16.04 Test

/root/robotpkg/mk/build/build.mk:198: recipe for target 'do-build' failed
make[1]: *** [do-build] Error 2
/root/robotpkg/mk/depends/depends.mk:70: recipe for target 'do-depends' failed
make: *** [do-depends] Error 1
make: *** [install] Error 2
/root/robotpkg/mk/internal/trusted.mk:36: recipe for target 'install' failed
Cleaning up project directory and file based variables
ERROR: Job failed: exit code 1

failed
format Test
./bindings/python/pinocchio/derivative/dcrba.py:451:13: E231 missing whitespace after ','
./bindings/python/pinocchio/derivative/dcrba.py:451:40: E231 missing whitespace after ','
./bindings/python/pinocchio/derivative/dcrba.py:451:51: E231 missing whitespace after ','
./bindings/python/pinocchio/derivative/dcrba.py:451:55: E231 missing whitespace after ','
./bindings/python/pinocchio/derivative/dcrba.py:451:58: E231 missing whitespace after ','
./bindings/python/pinocchio/derivative/dcrba.py:452:34: E231 missing whitespace after ','
./bindings/python/pinocchio/derivative/dcrba.py:455:1: W293 blank line contains whitespace
Cleaning up project directory and file based variables
ERROR: Job failed: exit code 1