fix std::vector initialisation in C++98

10 jobs for devel in 6 minutes and 48 seconds (queued for 1 second)
Status Name Job ID Coverage
  Test
canceled doc-coverage #115687

00:06:16

failed format #115689
allowed to fail

00:00:28

canceled robotpkg-pinocchio-18.04-release #115680
allowed to fail

00:06:19

canceled robotpkg-py-pinocchio-py2-18.04-release #115683
allowed to fail

00:06:18

failed robotpkg-py-pinocchio-py3-16.04-release #115681
allowed to fail

00:03:49

canceled robotpkg-py-pinocchio-py3-18.04-release #115682
allowed to fail

00:06:20

canceled robotpkg-py-pinocchio-py3-20.04-release #115684

00:06:19

canceled robotpkg-py-pinocchio-py3-buster-release #115685
allowed to fail

00:06:20

canceled robotpkg-py-pinocchio-py3-stretch-release #115686
allowed to fail

00:06:20

failed format #115688
allowed to fail

00:00:47

 
Name Stage Failure
failed
format Test
+      Jexp3<SETTO>(w, Jtmp3);
+ Jout.template bottomRightCorner<3, 3>() += Jtmp3;
+ Jout.template topLeftCorner<3, 3>() += Jtmp3;
+ const Vector3 p = Jtmp3.transpose() * v;
+ const Scalar wTp(w.dot(p));
+ const Matrix3 J(alphaSkew(.5, p) + (beta_dot_over_theta * wTp) * w * w.transpose() -
+ (t2 * beta_dot_over_theta + Scalar(2) * beta) * p * w.transpose() +
+
Job's log exceeded limit of 4194304 bytes.
Job execution will continue but no more output will be collected.

failed
robotpkg-py-pinocchio-py3-16.04-release Test

make[1]: *** [do-build] Error 2
/root/robotpkg/mk/build/build.mk:198: recipe for target 'do-build' failed
/root/robotpkg/mk/depends/depends.mk:70: recipe for target 'do-depends' failed
make: *** [do-depends] Error 1
make: *** [install] Error 2
/root/robotpkg/mk/internal/trusted.mk:36: recipe for target 'install' failed
Cleaning up file based variables
ERROR: Job failed: exit code 1