v4.2.1

11 jobs for v4.2.1 in 86 minutes and 17 seconds (queued for 48 minutes and 51 seconds)
latest
Name Stage Failure
failed
doc-coverage Test
------------------------------------------------------------------------------
CMakeFiles/3.10.2/CompilerIdCXX/CMakeCXXCompilerId.cpp
7 0 0% 553,555-557,559,573,575
------------------------------------------------------------------------------
TOTAL 7 0 0%
------------------------------------------------------------------------------
$ gcovr -r . --html --html-details -o ${CI_PROJECT_DIR}/coverage/index.html
Uploading artifacts for failed job
ERROR: Job failed: exit code 1
failed
robotpkg-jrl-walkgen-v3-stretch-release Test
For details or bug reports, check the complete log file in:
/root/robotpkg/wip/jrl-walkgen-v3/work.runner-7gqkM7SY-project-204-concurrent-0/configure.log
/root/robotpkg/mk/configure/cmake-configure.mk:100: recipe for target 'do-configure-cmake' failed
make: *** [do-configure-cmake] Error 1
make: *** [install] Error 2
/root/robotpkg/mk/internal/trusted.mk:36: recipe for target 'install' failed
Running after_script
Uploading artifacts for failed job
ERROR: Job failed: exit code 1
failed
robotpkg-jrl-walkgen-v3-16.04-release Test
For details or bug reports, check the complete log file in:
/root/robotpkg/wip/jrl-walkgen-v3/work.runner-7gqkM7SY-project-204-concurrent-2/configure.log
/root/robotpkg/mk/configure/cmake-configure.mk:100: recipe for target 'do-configure-cmake' failed
make: *** [do-configure-cmake] Error 1
/root/robotpkg/mk/internal/trusted.mk:36: recipe for target 'install' failed
make: *** [install] Error 2
Running after_script
Uploading artifacts for failed job
ERROR: Job failed: exit code 1
failed
format Test
-  bool sameFile2 =
- compareDebugFiles("TestRiccatiEquationWeightsWithInitialPose.dat");
+ bool sameFile2 = compareDebugFiles("TestRiccatiEquationWeightsWithInitialPose.dat");
delete anOCS;

if (sameFile && sameFile2) {
Running after_script
Uploading artifacts for failed job
ERROR: Job failed: exit code 1
failed
robotpkg-jrl-walkgen-v3-stretch-debug Test
For details or bug reports, check the complete log file in:
/root/robotpkg/wip/jrl-walkgen-v3/work.runner-7gqkM7SY-project-204-concurrent-1/configure.log
make: *** [do-configure-cmake] Error 1
/root/robotpkg/mk/configure/cmake-configure.mk:100: recipe for target 'do-configure-cmake' failed
/root/robotpkg/mk/internal/trusted.mk:36: recipe for target 'install' failed
make: *** [install] Error 2
Running after_script
Uploading artifacts for failed job
ERROR: Job failed: exit code 1
failed
robotpkg-jrl-walkgen-v3-18.04-debug Test
For details or bug reports, check the complete log file in:
/root/robotpkg/wip/jrl-walkgen-v3/work.runner-7gqkM7SY-project-204-concurrent-0/configure.log
/root/robotpkg/mk/configure/cmake-configure.mk:100: recipe for target 'do-configure-cmake' failed
make: *** [do-configure-cmake] Error 1
make: *** [install] Error 2
/root/robotpkg/mk/internal/trusted.mk:36: recipe for target 'install' failed
Running after_script
Uploading artifacts for failed job
ERROR: Job failed: exit code 1
failed
robotpkg-jrl-walkgen-v3-18.04-release Test
/root/robotpkg/wip/jrl-walkgen-v3/work.runner-7gqkM7SY-project-204-concurrent-2/configure.log

/root/robotpkg/mk/configure/cmake-configure.mk:100: recipe for target 'do-configure-cmake' failed
make: *** [do-configure-cmake] Error 1
make: *** [install] Error 2
/root/robotpkg/mk/internal/trusted.mk:36: recipe for target 'install' failed
Running after_script
Uploading artifacts for failed job
ERROR: Job failed: exit code 1
failed
robotpkg-jrl-walkgen-v3-16.04-debug Test
/root/robotpkg/wip/jrl-walkgen-v3/work.runner-7gqkM7SY-project-204-concurrent-1/configure.log

/root/robotpkg/mk/configure/cmake-configure.mk:100: recipe for target 'do-configure-cmake' failed
make: *** [do-configure-cmake] Error 1
/root/robotpkg/mk/internal/trusted.mk:36: recipe for target 'install' failed
make: *** [install] Error 2
Running after_script
Uploading artifacts for failed job
ERROR: Job failed: exit code 1