v4.2.5

5 jobs for v4.2.5 in 3 minutes and 47 seconds (queued for 2 seconds)
latest
Name Stage Failure
failed
doc-coverage Test
Running after script...
$ cd /root/robotpkg/wip/jrl-walkgen-v3
$ build=$(make show-var VARNAME=CONFIGURE_DIRS); cd $(make show-var VARNAME=WRKSRC); cd $build
$ make doc
make: Nothing to be done for 'doc'.
$ mv doc/doxygen-html ${CI_PROJECT_DIR}
mv: cannot stat 'doc/doxygen-html': No such file or directory
Cleaning up file based variables
ERROR: Job failed: exit code 1
failed
robotpkg-jrl-walkgen-v3-16.04-release Test

For details or bug reports, check the complete log file in:
/root/robotpkg/wip/jrl-walkgen-v3/work.runner-ke6dzkhd-project-204-concurrent-1/extract.log
make: *** [do-checkout] Error 128
/root/robotpkg/mk/extract/checkout.mk:225: recipe for target 'do-checkout' failed
/root/robotpkg/mk/internal/trusted.mk:36: recipe for target 'checkout' failed
make: *** [checkout] Error 2
Cleaning up file based variables
ERROR: Job failed: exit code 1
failed
robotpkg-jrl-walkgen-v3-18.04-release Test
| fatal: could not read Username for 'https://github.com': No such device or address
| fatal: clone of 'https://github.com/MaximilienNaveau/jrl-travis.git' into submodule path '/root/robotpkg/wip/jrl-walkgen-v3/work.runner-4rw8azke-project-204-concurrent-1/jrl-walkgen-4.2.5/.travis' failed
| Failed to clone '.travis' a second time, aborting
For details or bug reports, check the complete log file in:
/root/robotpkg/wip/jrl-walkgen-v3/work.runner-4rw8azke-project-204-concurrent-1/extract.log
make: *** [do-checkout] Error 1
make: *** [checkout] Error 2
Cleaning up file based variables
ERROR: Job failed: exit code 1
failed
format Test
-      m_PreviewControlTime(0)
-{
+ : SimplePlugin(lSPM), m_PreviewControlTime(0) {

m_ComAndFootRealization = 0;
m_PinocchioRobot = 0;
Running after_script
Uploading artifacts for failed job
ERROR: Job failed: exit code 1
failed
robotpkg-jrl-walkgen-v3-stretch-release Test
 delete mode 100644 tsid/depend.mk
delete mode 100644 tsid/distinfo
$ cd jrl-walkgen-v3
$ make checkout MASTER_REPOSITORY="git ${CI_PROJECT_DIR}/.git"
Makefile:17: ../../math/eiquadprog/depend.mk: No such file or directory
Makefile:24: ../../math/eigen-quadprog/depend.mk: No such file or directory
make: *** No rule to make target '../../math/eigen-quadprog/depend.mk'. Stop.
Cleaning up file based variables
ERROR: Job failed: exit code 1