sync submodule

10 jobs for v4.9.0 in 10 minutes and 24 seconds (queued for 27 minutes and 56 seconds)
latest
Status Job ID Name Coverage
  Test
failed #77621
doc-coverage

00:01:52

failed #77622
allowed to fail
format

00:01:48

failed #77616
robotpkg-py-hpp-rbprm-corba-16.04-debug

00:02:38

failed #77615
robotpkg-py-hpp-rbprm-corba-16.04-release

00:02:59

failed #77617
robotpkg-py-hpp-rbprm-corba-18.04-debug

00:02:23

failed #77618
robotpkg-py-hpp-rbprm-corba-18.04-release

00:03:08

failed #77614
robotpkg-py-hpp-rbprm-corba-py3-16.04-debug

00:02:52

failed #77613
robotpkg-py-hpp-rbprm-corba-py3-16.04-release

00:02:45

failed #77620
robotpkg-py-hpp-rbprm-corba-py3-18.04-debug

00:02:08

failed #77619
robotpkg-py-hpp-rbprm-corba-py3-18.04-release

00:02:50

 
Name Stage Failure
failed
format Test
   if (name == "builder") return rbprmBuilder_->implementation()._this();
- throw std::invalid_argument ("No servant " + name);
+ throw std::invalid_argument("No servant " + name);
}
} // namespace rbprm
} // namespace hpp
Running after_script
Uploading artifacts for failed job
ERROR: Job failed: exit code 1
failed
doc-coverage Test
------------------------------------------------------------------------------
CMakeFiles/3.10.2/CompilerIdCXX/CMakeCXXCompilerId.cpp
7 0 0% 553,555-557,559,573,575
------------------------------------------------------------------------------
TOTAL 7 0 0%
------------------------------------------------------------------------------
$ gcovr -r . --html --html-details -o ${CI_PROJECT_DIR}/coverage/index.html
Uploading artifacts for failed job
ERROR: Job failed: exit code 1
failed
robotpkg-py-hpp-rbprm-corba-py3-18.04-release Test
/root/robotpkg/wip/py-hpp-rbprm-corba/work.runner-sWwLEjyc-project-212-concurrent-3/configure.log

/root/robotpkg/mk/configure/cmake-configure.mk:100: recipe for target 'do-configure-cmake' failed
make: *** [do-configure-cmake] Error 1
make: *** [install] Error 2
/root/robotpkg/mk/internal/trusted.mk:36: recipe for target 'install' failed
Running after_script
Uploading artifacts for failed job
ERROR: Job failed: exit code 1
failed
robotpkg-py-hpp-rbprm-corba-py3-18.04-debug Test
/root/robotpkg/wip/py-hpp-rbprm-corba/work.runner-sWwLEjyc-project-212-concurrent-1/configure.log

/root/robotpkg/mk/configure/cmake-configure.mk:100: recipe for target 'do-configure-cmake' failed
make: *** [do-configure-cmake] Error 1
/root/robotpkg/mk/internal/trusted.mk:36: recipe for target 'install' failed
make: *** [install] Error 2
Running after_script
Uploading artifacts for failed job
ERROR: Job failed: exit code 1
failed
robotpkg-py-hpp-rbprm-corba-18.04-release Test
For details or bug reports, check the complete log file in:
/root/robotpkg/wip/py-hpp-rbprm-corba/work.runner-sWwLEjyc-project-212-concurrent-2/configure.log
/root/robotpkg/mk/configure/cmake-configure.mk:100: recipe for target 'do-configure-cmake' failed
make: *** [do-configure-cmake] Error 1
/root/robotpkg/mk/internal/trusted.mk:36: recipe for target 'install' failed
make: *** [install] Error 2
Running after_script
Uploading artifacts for failed job
ERROR: Job failed: exit code 1
failed
robotpkg-py-hpp-rbprm-corba-18.04-debug Test
For details or bug reports, check the complete log file in:
/root/robotpkg/wip/py-hpp-rbprm-corba/work.runner-sWwLEjyc-project-212-concurrent-0/configure.log
/root/robotpkg/mk/configure/cmake-configure.mk:100: recipe for target 'do-configure-cmake' failed
make: *** [do-configure-cmake] Error 1
make: *** [install] Error 2
/root/robotpkg/mk/internal/trusted.mk:36: recipe for target 'install' failed
Running after_script
Uploading artifacts for failed job
ERROR: Job failed: exit code 1
failed
robotpkg-py-hpp-rbprm-corba-16.04-debug Test
For details or bug reports, check the complete log file in:
/root/robotpkg/wip/py-hpp-rbprm-corba/work.runner-sWwLEjyc-project-212-concurrent-1/configure.log
/root/robotpkg/mk/configure/cmake-configure.mk:100: recipe for target 'do-configure-cmake' failed
make: *** [do-configure-cmake] Error 1
/root/robotpkg/mk/internal/trusted.mk:36: recipe for target 'install' failed
make: *** [install] Error 2
Running after_script
Uploading artifacts for failed job
ERROR: Job failed: exit code 1
failed
robotpkg-py-hpp-rbprm-corba-16.04-release Test
For details or bug reports, check the complete log file in:
/root/robotpkg/wip/py-hpp-rbprm-corba/work.runner-sWwLEjyc-project-212-concurrent-0/configure.log
/root/robotpkg/mk/configure/cmake-configure.mk:100: recipe for target 'do-configure-cmake' failed
make: *** [do-configure-cmake] Error 1
/root/robotpkg/mk/internal/trusted.mk:36: recipe for target 'install' failed
make: *** [install] Error 2
Running after_script
Uploading artifacts for failed job
ERROR: Job failed: exit code 1
failed
robotpkg-py-hpp-rbprm-corba-py3-16.04-debug Test
/root/robotpkg/mk/configure/cmake-configure.mk:100: recipe for target 'do-configure-cmake' failed
For details or bug reports, check the complete log file in:
/root/robotpkg/wip/py-hpp-rbprm-corba/work.runner-sWwLEjyc-project-212-concurrent-1/configure.log
make: *** [do-configure-cmake] Error 1
/root/robotpkg/mk/internal/trusted.mk:36: recipe for target 'install' failed
make: *** [install] Error 2
Running after_script
Uploading artifacts for failed job
ERROR: Job failed: exit code 1
failed
robotpkg-py-hpp-rbprm-corba-py3-16.04-release Test
/root/robotpkg/wip/py-hpp-rbprm-corba/work.runner-sWwLEjyc-project-212-concurrent-0/configure.log

/root/robotpkg/mk/configure/cmake-configure.mk:100: recipe for target 'do-configure-cmake' failed
make: *** [do-configure-cmake] Error 1
make: *** [install] Error 2
/root/robotpkg/mk/internal/trusted.mk:36: recipe for target 'install' failed
Running after_script
Uploading artifacts for failed job
ERROR: Job failed: exit code 1