sync submodule

10 jobs for master in 14 minutes and 45 seconds (queued for 14 minutes and 44 seconds)
Status Job ID Name Coverage
  Test
failed #77611
doc-coverage

00:02:45

failed #77612
allowed to fail
format

00:02:30

failed #77606
robotpkg-py-hpp-rbprm-corba-16.04-debug

00:02:40

failed #77605
robotpkg-py-hpp-rbprm-corba-16.04-release

00:02:46

failed #77607
robotpkg-py-hpp-rbprm-corba-18.04-debug

00:02:30

failed #77608
robotpkg-py-hpp-rbprm-corba-18.04-release

00:02:54

failed #77604
robotpkg-py-hpp-rbprm-corba-py3-16.04-debug

00:02:35

failed #77603
robotpkg-py-hpp-rbprm-corba-py3-16.04-release

00:01:59

failed #77610
robotpkg-py-hpp-rbprm-corba-py3-18.04-debug

00:02:20

failed #77609
robotpkg-py-hpp-rbprm-corba-py3-18.04-release

00:03:00

 
Name Stage Failure
failed
format Test
   if (name == "builder") return rbprmBuilder_->implementation()._this();
- throw std::invalid_argument ("No servant " + name);
+ throw std::invalid_argument("No servant " + name);
}
} // namespace rbprm
} // namespace hpp
Running after_script
Uploading artifacts for failed job
ERROR: Job failed: exit code 1
failed
doc-coverage Test
------------------------------------------------------------------------------
CMakeFiles/3.10.2/CompilerIdCXX/CMakeCXXCompilerId.cpp
7 0 0% 553,555-557,559,573,575
------------------------------------------------------------------------------
TOTAL 7 0 0%
------------------------------------------------------------------------------
$ gcovr -r . --html --html-details -o ${CI_PROJECT_DIR}/coverage/index.html
Uploading artifacts for failed job
ERROR: Job failed: exit code 1
failed
robotpkg-py-hpp-rbprm-corba-py3-18.04-debug Test
For details or bug reports, check the complete log file in:
/root/robotpkg/wip/py-hpp-rbprm-corba/work.runner-sWwLEjyc-project-212-concurrent-1/configure.log
make: *** [do-configure-cmake] Error 1
/root/robotpkg/mk/configure/cmake-configure.mk:100: recipe for target 'do-configure-cmake' failed
/root/robotpkg/mk/internal/trusted.mk:36: recipe for target 'install' failed
make: *** [install] Error 2
Running after_script
Uploading artifacts for failed job
ERROR: Job failed: exit code 1
failed
robotpkg-py-hpp-rbprm-corba-py3-18.04-release Test
For details or bug reports, check the complete log file in:
/root/robotpkg/wip/py-hpp-rbprm-corba/work.runner-sWwLEjyc-project-212-concurrent-0/configure.log
/root/robotpkg/mk/configure/cmake-configure.mk:100: recipe for target 'do-configure-cmake' failed
make: *** [do-configure-cmake] Error 1
/root/robotpkg/mk/internal/trusted.mk:36: recipe for target 'install' failed
make: *** [install] Error 2
Running after_script
Uploading artifacts for failed job
ERROR: Job failed: exit code 1
failed
robotpkg-py-hpp-rbprm-corba-18.04-release Test
For details or bug reports, check the complete log file in:
/root/robotpkg/wip/py-hpp-rbprm-corba/work.runner-sWwLEjyc-project-212-concurrent-1/configure.log
/root/robotpkg/mk/configure/cmake-configure.mk:100: recipe for target 'do-configure-cmake' failed
make: *** [do-configure-cmake] Error 1
make: *** [install] Error 2
/root/robotpkg/mk/internal/trusted.mk:36: recipe for target 'install' failed
Running after_script
Uploading artifacts for failed job
ERROR: Job failed: exit code 1
failed
robotpkg-py-hpp-rbprm-corba-18.04-debug Test
/root/robotpkg/wip/py-hpp-rbprm-corba/work.runner-sWwLEjyc-project-212-concurrent-0/configure.log

/root/robotpkg/mk/configure/cmake-configure.mk:100: recipe for target 'do-configure-cmake' failed
make: *** [do-configure-cmake] Error 1
/root/robotpkg/mk/internal/trusted.mk:36: recipe for target 'install' failed
make: *** [install] Error 2
Running after_script
Uploading artifacts for failed job
ERROR: Job failed: exit code 1
failed
robotpkg-py-hpp-rbprm-corba-16.04-debug Test
For details or bug reports, check the complete log file in:
/root/robotpkg/wip/py-hpp-rbprm-corba/work.runner-sWwLEjyc-project-212-concurrent-1/configure.log
/root/robotpkg/mk/configure/cmake-configure.mk:100: recipe for target 'do-configure-cmake' failed
make: *** [do-configure-cmake] Error 1
/root/robotpkg/mk/internal/trusted.mk:36: recipe for target 'install' failed
make: *** [install] Error 2
Running after_script
Uploading artifacts for failed job
ERROR: Job failed: exit code 1
failed
robotpkg-py-hpp-rbprm-corba-16.04-release Test
/root/robotpkg/wip/py-hpp-rbprm-corba/work.runner-sWwLEjyc-project-212-concurrent-0/configure.log

make: *** [do-configure-cmake] Error 1
/root/robotpkg/mk/configure/cmake-configure.mk:100: recipe for target 'do-configure-cmake' failed
make: *** [install] Error 2
/root/robotpkg/mk/internal/trusted.mk:36: recipe for target 'install' failed
Running after_script
Uploading artifacts for failed job
ERROR: Job failed: exit code 1
failed
robotpkg-py-hpp-rbprm-corba-py3-16.04-debug Test
For details or bug reports, check the complete log file in:
/root/robotpkg/wip/py-hpp-rbprm-corba/work.runner-sWwLEjyc-project-212-concurrent-1/configure.log
/root/robotpkg/mk/configure/cmake-configure.mk:100: recipe for target 'do-configure-cmake' failed
make: *** [do-configure-cmake] Error 1
/root/robotpkg/mk/internal/trusted.mk:36: recipe for target 'install' failed
make: *** [install] Error 2
Running after_script
Uploading artifacts for failed job
ERROR: Job failed: exit code 1
failed
robotpkg-py-hpp-rbprm-corba-py3-16.04-release Test
/root/robotpkg/wip/py-hpp-rbprm-corba/work.runner-sWwLEjyc-project-212-concurrent-0/configure.log

/root/robotpkg/mk/configure/cmake-configure.mk:100: recipe for target 'do-configure-cmake' failed
make: *** [do-configure-cmake] Error 1
/root/robotpkg/mk/internal/trusted.mk:36: recipe for target 'install' failed
make: *** [install] Error 2
Running after_script
Uploading artifacts for failed job
ERROR: Job failed: exit code 1