sync submodule

10 jobs for devel in 14 minutes and 30 seconds (queued for 1 minute and 52 seconds)
Status Job ID Name Coverage
  Test
failed #77601
doc-coverage

00:01:59

failed #77602
allowed to fail
format

00:01:50

failed #77596
robotpkg-py-hpp-rbprm-corba-16.04-debug

00:02:00

failed #77595
robotpkg-py-hpp-rbprm-corba-16.04-release

00:03:24

failed #77597
robotpkg-py-hpp-rbprm-corba-18.04-debug

00:02:05

failed #77598
robotpkg-py-hpp-rbprm-corba-18.04-release

00:01:51

failed #77594
robotpkg-py-hpp-rbprm-corba-py3-16.04-debug

00:03:45

failed #77593
robotpkg-py-hpp-rbprm-corba-py3-16.04-release

00:03:53

failed #77600
robotpkg-py-hpp-rbprm-corba-py3-18.04-debug

00:01:47

failed #77599
robotpkg-py-hpp-rbprm-corba-py3-18.04-release

00:01:24

 
Name Stage Failure
failed
format Test
   if (name == "builder") return rbprmBuilder_->implementation()._this();
- throw std::invalid_argument ("No servant " + name);
+ throw std::invalid_argument("No servant " + name);
}
} // namespace rbprm
} // namespace hpp
Running after_script
Uploading artifacts for failed job
ERROR: Job failed: exit code 1
failed
doc-coverage Test
------------------------------------------------------------------------------
CMakeFiles/3.10.2/CompilerIdCXX/CMakeCXXCompilerId.cpp
7 0 0% 553,555-557,559,573,575
------------------------------------------------------------------------------
TOTAL 7 0 0%
------------------------------------------------------------------------------
$ gcovr -r . --html --html-details -o ${CI_PROJECT_DIR}/coverage/index.html
Uploading artifacts for failed job
ERROR: Job failed: exit code 1
failed
robotpkg-py-hpp-rbprm-corba-py3-18.04-debug Test
For details or bug reports, check the complete log file in:
/root/robotpkg/wip/py-hpp-rbprm-corba/work.runner-sWwLEjyc-project-212-concurrent-1/configure.log
/root/robotpkg/mk/configure/cmake-configure.mk:100: recipe for target 'do-configure-cmake' failed
make: *** [do-configure-cmake] Error 1
/root/robotpkg/mk/internal/trusted.mk:36: recipe for target 'install' failed
make: *** [install] Error 2
Running after_script
Uploading artifacts for failed job
ERROR: Job failed: exit code 1
failed
robotpkg-py-hpp-rbprm-corba-py3-18.04-release Test
/root/robotpkg/wip/py-hpp-rbprm-corba/work.runner-sWwLEjyc-project-212-concurrent-0/configure.log
make: *** [do-configure-cmake] Error 1

/root/robotpkg/mk/configure/cmake-configure.mk:100: recipe for target 'do-configure-cmake' failed
/root/robotpkg/mk/internal/trusted.mk:36: recipe for target 'install' failed
make: *** [install] Error 2
Running after_script
Uploading artifacts for failed job
ERROR: Job failed: exit code 1
failed
robotpkg-py-hpp-rbprm-corba-18.04-release Test
For details or bug reports, check the complete log file in:
/root/robotpkg/wip/py-hpp-rbprm-corba/work.runner-sWwLEjyc-project-212-concurrent-1/configure.log
/root/robotpkg/mk/configure/cmake-configure.mk:100: recipe for target 'do-configure-cmake' failed
make: *** [do-configure-cmake] Error 1
/root/robotpkg/mk/internal/trusted.mk:36: recipe for target 'install' failed
make: *** [install] Error 2
Running after_script
Uploading artifacts for failed job
ERROR: Job failed: exit code 1
failed
robotpkg-py-hpp-rbprm-corba-18.04-debug Test
For details or bug reports, check the complete log file in:
/root/robotpkg/wip/py-hpp-rbprm-corba/work.runner-sWwLEjyc-project-212-concurrent-0/configure.log
/root/robotpkg/mk/configure/cmake-configure.mk:100: recipe for target 'do-configure-cmake' failed
make: *** [do-configure-cmake] Error 1
/root/robotpkg/mk/internal/trusted.mk:36: recipe for target 'install' failed
make: *** [install] Error 2
Running after_script
Uploading artifacts for failed job
ERROR: Job failed: exit code 1
failed
robotpkg-py-hpp-rbprm-corba-16.04-debug Test
For details or bug reports, check the complete log file in:
/root/robotpkg/wip/py-hpp-rbprm-corba/work.runner-sWwLEjyc-project-212-concurrent-1/configure.log
/root/robotpkg/mk/configure/cmake-configure.mk:100: recipe for target 'do-configure-cmake' failed
make: *** [do-configure-cmake] Error 1
/root/robotpkg/mk/internal/trusted.mk:36: recipe for target 'install' failed
make: *** [install] Error 2
Running after_script
Uploading artifacts for failed job
ERROR: Job failed: exit code 1
failed
robotpkg-py-hpp-rbprm-corba-16.04-release Test
For details or bug reports, check the complete log file in:
/root/robotpkg/wip/py-hpp-rbprm-corba/work.runner-sWwLEjyc-project-212-concurrent-0/configure.log
/root/robotpkg/mk/configure/cmake-configure.mk:100: recipe for target 'do-configure-cmake' failed
make: *** [do-configure-cmake] Error 1
make: *** [install] Error 2
/root/robotpkg/mk/internal/trusted.mk:36: recipe for target 'install' failed
Running after_script
Uploading artifacts for failed job
ERROR: Job failed: exit code 1
failed
robotpkg-py-hpp-rbprm-corba-py3-16.04-debug Test
/root/robotpkg/wip/py-hpp-rbprm-corba/work.runner-sWwLEjyc-project-212-concurrent-1/configure.log

/root/robotpkg/mk/configure/cmake-configure.mk:100: recipe for target 'do-configure-cmake' failed
make: *** [do-configure-cmake] Error 1
make: *** [install] Error 2
/root/robotpkg/mk/internal/trusted.mk:36: recipe for target 'install' failed
Running after_script
Uploading artifacts for failed job
ERROR: Job failed: exit code 1
failed
robotpkg-py-hpp-rbprm-corba-py3-16.04-release Test
For details or bug reports, check the complete log file in:
/root/robotpkg/wip/py-hpp-rbprm-corba/work.runner-sWwLEjyc-project-212-concurrent-0/configure.log
/root/robotpkg/mk/configure/cmake-configure.mk:100: recipe for target 'do-configure-cmake' failed
make: *** [do-configure-cmake] Error 1
/root/robotpkg/mk/internal/trusted.mk:36: recipe for target 'install' failed
make: *** [install] Error 2
Running after_script
Uploading artifacts for failed job
ERROR: Job failed: exit code 1