v4.11.0

6 jobs for v4.11.0 in 1 minute and 44 seconds (queued for 8 seconds)
latest
Status Name Job ID Coverage
  Test
failed doc-coverage #117797

00:00:38

failed format #117798
allowed to fail

00:01:06

failed robotpkg-py-hpp-rbprm-corba-py2-18.04-release #117791
allowed to fail

00:01:33

failed robotpkg-py-hpp-rbprm-corba-py3-18.04-release #117789
allowed to fail

00:01:35

failed robotpkg-py-hpp-rbprm-corba-py3-20.04-release #117793
allowed to fail

00:01:42

failed robotpkg-py-hpp-rbprm-corba-py3-ferrum-release #117796
allowed to fail

00:01:36

 
Name Stage Failure
failed
doc-coverage Test
make: *** [install] Error 2
/root/robotpkg/mk/internal/trusted.mk:36: recipe for target 'install' failed
Running after_script
Running after script...
$ cd /root/robotpkg/path/py-hpp-rbprm-corba
$ build=$(make show-var VARNAME=CONFIGURE_DIRS); cd $(make show-var VARNAME=WRKSRC); cd $build
/bin/bash: line 119: cd: build: No such file or directory
Cleaning up file based variables
ERROR: Job failed: exit code 1
failed
format Test
+::CORBA::Object_ptr Server::servant(const std::string& name) const {
if (name == "builder") return rbprmBuilder_->implementation()._this();
- throw std::invalid_argument ("No servant " + name);
+ throw std::invalid_argument("No servant " + name);
}
} // namespace rbprm
} // namespace hpp
Cleaning up file based variables
ERROR: Job failed: exit code 1
failed
robotpkg-py-hpp-rbprm-corba-py3-20.04-release Test
ERROR: dependencies. If a robotpkg version of a dependency is available,
ERROR: you can configure robotpkg.conf to use this version instead.
ERROR:
ERROR: See /root/robotpkg/path/py-hpp-rbprm-corba/work/sysdep.log for details.
ERROR: ======================================================================
make: *** [/root/robotpkg/mk/depends/depends.mk:70: do-depends] Error 1
make: *** [/root/robotpkg/mk/internal/trusted.mk:36: install] Error 2
Cleaning up file based variables
ERROR: Job failed: exit code 1
failed
robotpkg-py-hpp-rbprm-corba-py3-18.04-release Test
ERROR:
ERROR: See /root/robotpkg/path/py-hpp-rbprm-corba/work/sysdep.log for details.
ERROR: ======================================================================
/root/robotpkg/mk/depends/depends.mk:70: recipe for target 'do-depends' failed
make: *** [do-depends] Error 1
make: *** [install] Error 2
/root/robotpkg/mk/internal/trusted.mk:36: recipe for target 'install' failed
Cleaning up file based variables
ERROR: Job failed: exit code 1
failed
robotpkg-py-hpp-rbprm-corba-py3-ferrum-release Test
ERROR:
ERROR: See /root/robotpkg/path/py-hpp-rbprm-corba/work.runner-swwlejyc-project-212-concurrent-2/sysdep.log for details.
ERROR: ======================================================================
make: *** [do-depends] Error 1
/root/robotpkg/mk/depends/depends.mk:70: recipe for target 'do-depends' failed
/root/robotpkg/mk/internal/trusted.mk:36: recipe for target 'install' failed
make: *** [install] Error 2
Cleaning up file based variables
ERROR: Job failed: exit code 1
failed
robotpkg-py-hpp-rbprm-corba-py2-18.04-release Test
ERROR:
ERROR: See /root/robotpkg/path/py-hpp-rbprm-corba/work/sysdep.log for details.
ERROR: ======================================================================
/root/robotpkg/mk/depends/depends.mk:70: recipe for target 'do-depends' failed
make: *** [do-depends] Error 1
/root/robotpkg/mk/internal/trusted.mk:36: recipe for target 'install' failed
make: *** [install] Error 2
Cleaning up file based variables
ERROR: Job failed: exit code 1