Merge branch 'master' into devel

6 jobs for devel in 2 minutes and 11 seconds (queued for 3 seconds)
latest
Status Name Job ID Coverage
  Test
failed doc-coverage #117772

00:00:44

failed format #117774
allowed to fail

00:00:09

failed robotpkg-py-hpp-rbprm-corba-py2-18.04-release #117766
allowed to fail

00:00:57

failed robotpkg-py-hpp-rbprm-corba-py3-18.04-release #117764
allowed to fail

00:00:44

failed robotpkg-py-hpp-rbprm-corba-py3-20.04-release #117768
allowed to fail

00:01:29

failed robotpkg-py-hpp-rbprm-corba-py3-ferrum-release #117770
allowed to fail

00:02:10

 
Name Stage Failure
failed
robotpkg-py-hpp-rbprm-corba-py3-18.04-release Test
ERROR:
ERROR: See /root/robotpkg/path/py-hpp-rbprm-corba/work/sysdep.log for details.
ERROR: ======================================================================
/root/robotpkg/mk/depends/depends.mk:70: recipe for target 'do-depends' failed
make: *** [do-depends] Error 1
make: *** [install] Error 2
/root/robotpkg/mk/internal/trusted.mk:36: recipe for target 'install' failed
Cleaning up file based variables
ERROR: Job failed: exit code 1
failed
robotpkg-py-hpp-rbprm-corba-py3-ferrum-release Test
ERROR:
ERROR: See /root/robotpkg/path/py-hpp-rbprm-corba/work.runner-ke6dzkhd-project-212-concurrent-0/sysdep.log for details.
ERROR: ======================================================================
/root/robotpkg/mk/depends/depends.mk:70: recipe for target 'do-depends' failed
make: *** [do-depends] Error 1
/root/robotpkg/mk/internal/trusted.mk:36: recipe for target 'install' failed
make: *** [install] Error 2
Cleaning up file based variables
ERROR: Job failed: exit code 1
failed
doc-coverage Test
make: *** [install] Error 2
/root/robotpkg/mk/internal/trusted.mk:36: recipe for target 'install' failed
Running after_script
Running after script...
$ cd /root/robotpkg/path/py-hpp-rbprm-corba
$ build=$(make show-var VARNAME=CONFIGURE_DIRS); cd $(make show-var VARNAME=WRKSRC); cd $build
/bin/bash: line 118: cd: build: No such file or directory
Cleaning up file based variables
ERROR: Job failed: exit code 1
failed
format Test
+::CORBA::Object_ptr Server::servant(const std::string& name) const {
if (name == "builder") return rbprmBuilder_->implementation()._this();
- throw std::invalid_argument ("No servant " + name);
+ throw std::invalid_argument("No servant " + name);
}
} // namespace rbprm
} // namespace hpp
Cleaning up file based variables
ERROR: Job failed: exit code 1
failed
robotpkg-py-hpp-rbprm-corba-py2-18.04-release Test
ERROR:
ERROR: See /root/robotpkg/path/py-hpp-rbprm-corba/work/sysdep.log for details.
ERROR: ======================================================================
make: *** [do-depends] Error 1
/root/robotpkg/mk/depends/depends.mk:70: recipe for target 'do-depends' failed
make: *** [install] Error 2
/root/robotpkg/mk/internal/trusted.mk:36: recipe for target 'install' failed
Cleaning up file based variables
ERROR: Job failed: exit code 1
failed
robotpkg-py-hpp-rbprm-corba-py3-20.04-release Test
ERROR: dependencies. If a robotpkg version of a dependency is available,
ERROR: you can configure robotpkg.conf to use this version instead.
ERROR:
ERROR: See /root/robotpkg/path/py-hpp-rbprm-corba/work/sysdep.log for details.
ERROR: ======================================================================
make: *** [/root/robotpkg/mk/depends/depends.mk:70: do-depends] Error 1
make: *** [/root/robotpkg/mk/internal/trusted.mk:36: install] Error 2
Cleaning up file based variables
ERROR: Job failed: exit code 1