sync submodule

10 jobs for master in 4 minutes and 17 seconds (queued for 3 seconds)
latest
Status Job ID Name Coverage
  Test
failed #76824
doc-coverage

00:00:26

failed #76825
allowed to fail
format

00:00:19

failed #76817
allowed to fail
robotpkg-py-qt-hpp-gui-16.04-debug

00:04:12

failed #76816
allowed to fail
robotpkg-py-qt-hpp-gui-16.04-release

00:04:17

failed #76823
allowed to fail
robotpkg-py-qt-hpp-gui-18.04-debug

00:00:24

failed #76822
allowed to fail
robotpkg-py-qt-hpp-gui-18.04-release

00:00:25

failed #76819
robotpkg-py-qt-hpp-gui-py3-16.04-debug

00:00:26

failed #76818
robotpkg-py-qt-hpp-gui-py3-16.04-release

00:00:22

failed #76821
robotpkg-py-qt-hpp-gui-py3-18.04-debug

00:00:23

failed #76820
robotpkg-py-qt-hpp-gui-py3-18.04-release

00:00:23

 
Name Stage Failure
failed
robotpkg-py-qt-hpp-gui-16.04-release Test
For details or bug reports, check the complete log file in:
/root/robotpkg/graphics/py-qt-hpp-gui/work.runner-sWwLEjyc-project-344-concurrent-6/configure.log
/root/robotpkg/mk/configure/cmake-configure.mk:100: recipe for target 'do-configure-cmake' failed
make: *** [do-configure-cmake] Error 1
/root/robotpkg/mk/internal/trusted.mk:36: recipe for target 'install' failed
make: *** [install] Error 2
Running after_script
Uploading artifacts for failed job
ERROR: Job failed: exit code 1
failed
robotpkg-py-qt-hpp-gui-16.04-debug Test
/root/robotpkg/graphics/py-qt-hpp-gui/work.runner-sWwLEjyc-project-344-concurrent-7/configure.log

/root/robotpkg/mk/configure/cmake-configure.mk:100: recipe for target 'do-configure-cmake' failed
make: *** [do-configure-cmake] Error 1
/root/robotpkg/mk/internal/trusted.mk:36: recipe for target 'install' failed
make: *** [install] Error 2
Running after_script
Uploading artifacts for failed job
ERROR: Job failed: exit code 1
failed
doc-coverage Test
------------------------------------------------------------------------------
CMakeFiles/3.10.2/CompilerIdCXX/CMakeCXXCompilerId.cpp
7 0 0% 553,555-557,559,573,575
------------------------------------------------------------------------------
TOTAL 7 0 0%
------------------------------------------------------------------------------
$ gcovr -r . --html --html-details -o ${CI_PROJECT_DIR}/coverage/index.html
Uploading artifacts for failed job
ERROR: Job failed: exit code 1
failed
robotpkg-py-qt-hpp-gui-18.04-release Test
For details or bug reports, check the complete log file in:
/root/robotpkg/graphics/py-qt-hpp-gui/work.runner-ke6dzkhd-project-344-concurrent-7/configure.log
make: *** [do-configure-cmake] Error 1
/root/robotpkg/mk/configure/cmake-configure.mk:100: recipe for target 'do-configure-cmake' failed
make: *** [install] Error 2
/root/robotpkg/mk/internal/trusted.mk:36: recipe for target 'install' failed
Running after_script
Uploading artifacts for failed job
ERROR: Job failed: exit code 1
failed
robotpkg-py-qt-hpp-gui-18.04-debug Test
For details or bug reports, check the complete log file in:
/root/robotpkg/graphics/py-qt-hpp-gui/work.runner-ke6dzkhd-project-344-concurrent-8/configure.log
/root/robotpkg/mk/configure/cmake-configure.mk:100: recipe for target 'do-configure-cmake' failed
make: *** [do-configure-cmake] Error 1
/root/robotpkg/mk/internal/trusted.mk:36: recipe for target 'install' failed
make: *** [install] Error 2
Running after_script
Uploading artifacts for failed job
ERROR: Job failed: exit code 1
failed
robotpkg-py-qt-hpp-gui-py3-16.04-debug Test
For details or bug reports, check the complete log file in:
/root/robotpkg/graphics/py-qt-hpp-gui/work.runner-qTZ7NXCE-project-344-concurrent-0/configure.log
make: *** [do-configure-cmake] Error 1
/root/robotpkg/mk/configure/cmake-configure.mk:100: recipe for target 'do-configure-cmake' failed
/root/robotpkg/mk/internal/trusted.mk:36: recipe for target 'install' failed
make: *** [install] Error 2
Running after_script
Uploading artifacts for failed job
ERROR: Job failed: exit code 1
failed
robotpkg-py-qt-hpp-gui-py3-18.04-debug Test
For details or bug reports, check the complete log file in:
/root/robotpkg/graphics/py-qt-hpp-gui/work.runner-ke6dzkhd-project-344-concurrent-6/configure.log
/root/robotpkg/mk/configure/cmake-configure.mk:100: recipe for target 'do-configure-cmake' failed
make: *** [do-configure-cmake] Error 1
/root/robotpkg/mk/internal/trusted.mk:36: recipe for target 'install' failed
make: *** [install] Error 2
Running after_script
Uploading artifacts for failed job
ERROR: Job failed: exit code 1
failed
robotpkg-py-qt-hpp-gui-py3-18.04-release Test
/root/robotpkg/graphics/py-qt-hpp-gui/work.runner-ke6dzkhd-project-344-concurrent-5/configure.log

/root/robotpkg/mk/configure/cmake-configure.mk:100: recipe for target 'do-configure-cmake' failed
make: *** [do-configure-cmake] Error 1
/root/robotpkg/mk/internal/trusted.mk:36: recipe for target 'install' failed
make: *** [install] Error 2
Running after_script
Uploading artifacts for failed job
ERROR: Job failed: exit code 1
failed
format Test
+};
+} // namespace gui
+} // namespace hpp

-#endif // HPP_GUI_REMOTEIMUPLUGIN_HH
+#endif // HPP_GUI_REMOTEIMUPLUGIN_HH
Running after_script
Uploading artifacts for failed job
ERROR: Job failed: exit code 1
failed
robotpkg-py-qt-hpp-gui-py3-16.04-release Test
/root/robotpkg/graphics/py-qt-hpp-gui/work.runner-ke6dzkhd-project-344-concurrent-4/configure.log

make: *** [do-configure-cmake] Error 1
/root/robotpkg/mk/configure/cmake-configure.mk:100: recipe for target 'do-configure-cmake' failed
/root/robotpkg/mk/internal/trusted.mk:36: recipe for target 'install' failed
make: *** [install] Error 2
Running after_script
Uploading artifacts for failed job
ERROR: Job failed: exit code 1