sync submodule

10 jobs for devel in 5 minutes and 5 seconds (queued for 2 seconds)
latest
Status Job ID Name Coverage
  Test
failed #76814
doc-coverage

00:05:03

failed #76815
allowed to fail
format

00:04:02

failed #76807
allowed to fail
robotpkg-py-qt-hpp-gui-16.04-debug

00:00:32

failed #76806
allowed to fail
robotpkg-py-qt-hpp-gui-16.04-release

00:04:05

failed #76813
allowed to fail
robotpkg-py-qt-hpp-gui-18.04-debug

00:00:27

failed #76812
allowed to fail
robotpkg-py-qt-hpp-gui-18.04-release

00:04:39

failed #76809
robotpkg-py-qt-hpp-gui-py3-16.04-debug

00:00:31

failed #76808
robotpkg-py-qt-hpp-gui-py3-16.04-release

00:05:05

failed #76811
robotpkg-py-qt-hpp-gui-py3-18.04-debug

00:00:31

failed #76810
robotpkg-py-qt-hpp-gui-py3-18.04-release

00:04:46

 
Name Stage Failure
failed
doc-coverage Test
------------------------------------------------------------------------------
CMakeFiles/3.10.2/CompilerIdCXX/CMakeCXXCompilerId.cpp
7 0 0% 553,555-557,559,573,575
------------------------------------------------------------------------------
TOTAL 7 0 0%
------------------------------------------------------------------------------
$ gcovr -r . --html --html-details -o ${CI_PROJECT_DIR}/coverage/index.html
Uploading artifacts for failed job
ERROR: Job failed: exit code 1
failed
robotpkg-py-qt-hpp-gui-py3-16.04-release Test
/root/robotpkg/graphics/py-qt-hpp-gui/work.runner-sWwLEjyc-project-344-concurrent-1/configure.log

make: *** [do-configure-cmake] Error 1
/root/robotpkg/mk/configure/cmake-configure.mk:100: recipe for target 'do-configure-cmake' failed
/root/robotpkg/mk/internal/trusted.mk:36: recipe for target 'install' failed
make: *** [install] Error 2
Running after_script
Uploading artifacts for failed job
ERROR: Job failed: exit code 1
failed
robotpkg-py-qt-hpp-gui-py3-18.04-release Test
/root/robotpkg/graphics/py-qt-hpp-gui/work.runner-sWwLEjyc-project-344-concurrent-2/configure.log

/root/robotpkg/mk/configure/cmake-configure.mk:100: recipe for target 'do-configure-cmake' failed
make: *** [do-configure-cmake] Error 1
/root/robotpkg/mk/internal/trusted.mk:36: recipe for target 'install' failed
make: *** [install] Error 2
Running after_script
Uploading artifacts for failed job
ERROR: Job failed: exit code 1
failed
robotpkg-py-qt-hpp-gui-18.04-release Test
For details or bug reports, check the complete log file in:
/root/robotpkg/graphics/py-qt-hpp-gui/work.runner-sWwLEjyc-project-344-concurrent-3/configure.log
/root/robotpkg/mk/configure/cmake-configure.mk:100: recipe for target 'do-configure-cmake' failed
make: *** [do-configure-cmake] Error 1
make: *** [install] Error 2
/root/robotpkg/mk/internal/trusted.mk:36: recipe for target 'install' failed
Running after_script
Uploading artifacts for failed job
ERROR: Job failed: exit code 1
failed
robotpkg-py-qt-hpp-gui-16.04-release Test
For details or bug reports, check the complete log file in:
/root/robotpkg/graphics/py-qt-hpp-gui/work.runner-sWwLEjyc-project-344-concurrent-0/configure.log
/root/robotpkg/mk/configure/cmake-configure.mk:100: recipe for target 'do-configure-cmake' failed
make: *** [do-configure-cmake] Error 1
/root/robotpkg/mk/internal/trusted.mk:36: recipe for target 'install' failed
make: *** [install] Error 2
Running after_script
Uploading artifacts for failed job
ERROR: Job failed: exit code 1
failed
format Test
+};
+} // namespace gui
+} // namespace hpp

-#endif // HPP_GUI_REMOTEIMUPLUGIN_HH
+#endif // HPP_GUI_REMOTEIMUPLUGIN_HH
Running after_script
Uploading artifacts for failed job
ERROR: Job failed: exit code 1
failed
robotpkg-py-qt-hpp-gui-py3-18.04-debug Test
For details or bug reports, check the complete log file in:
/root/robotpkg/graphics/py-qt-hpp-gui/work.runner-ke6dzkhd-project-344-concurrent-2/configure.log
/root/robotpkg/mk/configure/cmake-configure.mk:100: recipe for target 'do-configure-cmake' failed
make: *** [do-configure-cmake] Error 1
/root/robotpkg/mk/internal/trusted.mk:36: recipe for target 'install' failed
make: *** [install] Error 2
Running after_script
Uploading artifacts for failed job
ERROR: Job failed: exit code 1
failed
robotpkg-py-qt-hpp-gui-py3-16.04-debug Test
For details or bug reports, check the complete log file in:
/root/robotpkg/graphics/py-qt-hpp-gui/work.runner-ke6dzkhd-project-344-concurrent-1/configure.log
/root/robotpkg/mk/configure/cmake-configure.mk:100: recipe for target 'do-configure-cmake' failed
make: *** [do-configure-cmake] Error 1
/root/robotpkg/mk/internal/trusted.mk:36: recipe for target 'install' failed
make: *** [install] Error 2
Running after_script
Uploading artifacts for failed job
ERROR: Job failed: exit code 1
failed
robotpkg-py-qt-hpp-gui-16.04-debug Test
For details or bug reports, check the complete log file in:
/root/robotpkg/graphics/py-qt-hpp-gui/work.runner-ke6dzkhd-project-344-concurrent-0/configure.log
/root/robotpkg/mk/configure/cmake-configure.mk:100: recipe for target 'do-configure-cmake' failed
make: *** [do-configure-cmake] Error 1
make: *** [install] Error 2
/root/robotpkg/mk/internal/trusted.mk:36: recipe for target 'install' failed
Running after_script
Uploading artifacts for failed job
ERROR: Job failed: exit code 1
failed
robotpkg-py-qt-hpp-gui-18.04-debug Test
For details or bug reports, check the complete log file in:
/root/robotpkg/graphics/py-qt-hpp-gui/work.runner-ke6dzkhd-project-344-concurrent-3/configure.log
make: *** [do-configure-cmake] Error 1
/root/robotpkg/mk/configure/cmake-configure.mk:100: recipe for target 'do-configure-cmake' failed
/root/robotpkg/mk/internal/trusted.mk:36: recipe for target 'install' failed
make: *** [install] Error 2
Running after_script
Uploading artifacts for failed job
ERROR: Job failed: exit code 1