sync submodule

10 jobs for v4.9.0 in 29 seconds (queued for 24 seconds)
latest
Status Name Job ID Coverage
  Test
failed doc-coverage #76834

00:00:23

failed format #76835
allowed to fail

00:00:17

failed robotpkg-py-qt-hpp-gui-16.04-debug #76827
allowed to fail

00:00:25

failed robotpkg-py-qt-hpp-gui-16.04-release #76826
allowed to fail

00:00:23

failed robotpkg-py-qt-hpp-gui-18.04-debug #76833
allowed to fail

00:00:23

failed robotpkg-py-qt-hpp-gui-18.04-release #76832
allowed to fail

00:00:22

failed robotpkg-py-qt-hpp-gui-py3-16.04-debug #76829

00:00:23

failed robotpkg-py-qt-hpp-gui-py3-16.04-release #76828

00:00:26

failed robotpkg-py-qt-hpp-gui-py3-18.04-debug #76831

00:00:22

failed robotpkg-py-qt-hpp-gui-py3-18.04-release #76830

00:00:24

 
Name Stage Failure
failed
doc-coverage Test
------------------------------------------------------------------------------
CMakeFiles/3.10.2/CompilerIdCXX/CMakeCXXCompilerId.cpp
7 0 0% 553,555-557,559,573,575
------------------------------------------------------------------------------
TOTAL 7 0 0%
------------------------------------------------------------------------------
$ gcovr -r . --html --html-details -o ${CI_PROJECT_DIR}/coverage/index.html
Uploading artifacts for failed job
ERROR: Job failed: exit code 1
failed
robotpkg-py-qt-hpp-gui-18.04-release Test
For details or bug reports, check the complete log file in:
/root/robotpkg/graphics/py-qt-hpp-gui/work.runner-ke6dzkhd-project-344-concurrent-10/configure.log
make: *** [do-configure-cmake] Error 1
/root/robotpkg/mk/configure/cmake-configure.mk:100: recipe for target 'do-configure-cmake' failed
/root/robotpkg/mk/internal/trusted.mk:36: recipe for target 'install' failed
make: *** [install] Error 2
Running after_script
Uploading artifacts for failed job
ERROR: Job failed: exit code 1
failed
robotpkg-py-qt-hpp-gui-py3-18.04-debug Test
For details or bug reports, check the complete log file in:
/root/robotpkg/graphics/py-qt-hpp-gui/work.runner-ke6dzkhd-project-344-concurrent-2/configure.log
/root/robotpkg/mk/configure/cmake-configure.mk:100: recipe for target 'do-configure-cmake' failed
make: *** [do-configure-cmake] Error 1
make: *** [install] Error 2
/root/robotpkg/mk/internal/trusted.mk:36: recipe for target 'install' failed
Running after_script
Uploading artifacts for failed job
ERROR: Job failed: exit code 1
failed
robotpkg-py-qt-hpp-gui-py3-16.04-debug Test
For details or bug reports, check the complete log file in:
/root/robotpkg/graphics/py-qt-hpp-gui/work.runner-ke6dzkhd-project-344-concurrent-0/configure.log
/root/robotpkg/mk/configure/cmake-configure.mk:100: recipe for target 'do-configure-cmake' failed
make: *** [do-configure-cmake] Error 1
/root/robotpkg/mk/internal/trusted.mk:36: recipe for target 'install' failed
make: *** [install] Error 2
Running after_script
Uploading artifacts for failed job
ERROR: Job failed: exit code 1
failed
robotpkg-py-qt-hpp-gui-16.04-debug Test
For details or bug reports, check the complete log file in:
/root/robotpkg/graphics/py-qt-hpp-gui/work.runner-qTZ7NXCE-project-344-concurrent-2/configure.log
make: *** [do-configure-cmake] Error 1
/root/robotpkg/mk/configure/cmake-configure.mk:100: recipe for target 'do-configure-cmake' failed
make: *** [install] Error 2
/root/robotpkg/mk/internal/trusted.mk:36: recipe for target 'install' failed
Running after_script
Uploading artifacts for failed job
ERROR: Job failed: exit code 1
failed
robotpkg-py-qt-hpp-gui-16.04-release Test
For details or bug reports, check the complete log file in:
/root/robotpkg/graphics/py-qt-hpp-gui/work.runner-ke6dzkhd-project-344-concurrent-9/configure.log
/root/robotpkg/mk/configure/cmake-configure.mk:100: recipe for target 'do-configure-cmake' failed
make: *** [do-configure-cmake] Error 1
/root/robotpkg/mk/internal/trusted.mk:36: recipe for target 'install' failed
make: *** [install] Error 2
Running after_script
Uploading artifacts for failed job
ERROR: Job failed: exit code 1
failed
format Test
+};
+} // namespace gui
+} // namespace hpp

-#endif // HPP_GUI_REMOTEIMUPLUGIN_HH
+#endif // HPP_GUI_REMOTEIMUPLUGIN_HH
Running after_script
Uploading artifacts for failed job
ERROR: Job failed: exit code 1
failed
robotpkg-py-qt-hpp-gui-py3-18.04-release Test
For details or bug reports, check the complete log file in:
/root/robotpkg/graphics/py-qt-hpp-gui/work.runner-ke6dzkhd-project-344-concurrent-1/configure.log
/root/robotpkg/mk/configure/cmake-configure.mk:100: recipe for target 'do-configure-cmake' failed
make: *** [do-configure-cmake] Error 1
/root/robotpkg/mk/internal/trusted.mk:36: recipe for target 'install' failed
make: *** [install] Error 2
Running after_script
Uploading artifacts for failed job
ERROR: Job failed: exit code 1
failed
robotpkg-py-qt-hpp-gui-py3-16.04-release Test
For details or bug reports, check the complete log file in:
/root/robotpkg/graphics/py-qt-hpp-gui/work.runner-qTZ7NXCE-project-344-concurrent-3/configure.log
make: *** [do-configure-cmake] Error 1
/root/robotpkg/mk/configure/cmake-configure.mk:100: recipe for target 'do-configure-cmake' failed
/root/robotpkg/mk/internal/trusted.mk:36: recipe for target 'install' failed
make: *** [install] Error 2
Running after_script
Uploading artifacts for failed job
ERROR: Job failed: exit code 1
failed
robotpkg-py-qt-hpp-gui-18.04-debug Test
/root/robotpkg/graphics/py-qt-hpp-gui/work.runner-ke6dzkhd-project-344-concurrent-11/configure.log

/root/robotpkg/mk/configure/cmake-configure.mk:100: recipe for target 'do-configure-cmake' failed
make: *** [do-configure-cmake] Error 1
/root/robotpkg/mk/internal/trusted.mk:36: recipe for target 'install' failed
make: *** [install] Error 2
Running after_script
Uploading artifacts for failed job
ERROR: Job failed: exit code 1