v4.11.0

6 jobs for v4.11.0 in 2 minutes and 22 seconds (queued for 4 seconds)
latest
Status Job ID Name Coverage
  Test
failed doc-coverage #117761

00:00:10

failed format #117762
allowed to fail

00:00:12

passed robotpkg-py-qt-hpp-gui-py2-18.04-release #117757

00:02:20

failed robotpkg-py-qt-hpp-gui-py3-18.04-release #117758
allowed to fail

00:01:28

failed robotpkg-py-qt-hpp-gui-py3-20.04-release #117759
allowed to fail

00:01:02

failed robotpkg-py-qt-hpp-gui-py3-ferrum-release #117760
allowed to fail

00:01:32

 
Name Stage Failure
failed
doc-coverage Test
Running after script...
$ cd /root/robotpkg/graphics/py-qt-hpp-gui
$ build=$(make show-var VARNAME=CONFIGURE_DIRS); cd $(make show-var VARNAME=WRKSRC); cd $build
$ make doc
make: Nothing to be done for 'doc'.
$ mv doc/doxygen-html ${CI_PROJECT_DIR}
mv: cannot stat 'doc/doxygen-html': No such file or directory
Cleaning up file based variables
ERROR: Job failed: exit code 1
failed
format Test
+  AttitudeDeviceMsgBox* msgBox_;
+};
+} // namespace gui
+} // namespace hpp

-#endif // HPP_GUI_REMOTEIMUPLUGIN_HH
+#endif // HPP_GUI_REMOTEIMUPLUGIN_HH
Cleaning up file based variables
ERROR: Job failed: exit code 1
failed
robotpkg-py-qt-hpp-gui-py3-20.04-release Test
ERROR: dependencies. If a robotpkg version of a dependency is available,
ERROR: you can configure robotpkg.conf to use this version instead.
ERROR:
ERROR: See /root/robotpkg/graphics/py-qt-hpp-gui/work/sysdep.log for details.
ERROR: ======================================================================
make: *** [/root/robotpkg/mk/depends/depends.mk:70: do-depends] Error 1
make: *** [/root/robotpkg/mk/internal/trusted.mk:36: install] Error 2
Cleaning up file based variables
ERROR: Job failed: exit code 1
failed
robotpkg-py-qt-hpp-gui-py3-ferrum-release Test
ERROR:
ERROR: See /root/robotpkg/graphics/py-qt-hpp-gui/work.runner-5nsakv6-project-344-concurrent-1/sysdep.log for details.
ERROR: ======================================================================
/root/robotpkg/mk/depends/depends.mk:70: recipe for target 'do-depends' failed
make: *** [do-depends] Error 1
/root/robotpkg/mk/internal/trusted.mk:36: recipe for target 'install' failed
make: *** [install] Error 2
Cleaning up file based variables
ERROR: Job failed: exit code 1
failed
robotpkg-py-qt-hpp-gui-py3-18.04-release Test
ERROR:
ERROR: See /root/robotpkg/graphics/py-qt-hpp-gui/work/sysdep.log for details.
ERROR: ======================================================================
/root/robotpkg/mk/depends/depends.mk:70: recipe for target 'do-depends' failed
make: *** [do-depends] Error 1
/root/robotpkg/mk/internal/trusted.mk:36: recipe for target 'install' failed
make: *** [install] Error 2
Cleaning up file based variables
ERROR: Job failed: exit code 1