Merge remote-tracking branch 'origin/coverage' into coverage

6 jobs for coverage in 1 minute and 45 seconds (queued for 3 seconds)
latest
Name Stage Failure
failed
robotpkg-dynamic-graph-v3-20.04 Test
| make[1]: Leaving directory '/root/robotpkg/wip/dynamic-graph-v3/work/dynamic-graph-4.4.0'
| make[1]: *** [CMakeFiles/Makefile2:624: src/CMakeFiles/dynamic-graph.dir/all] Error 2
| make: *** [Makefile:144: all] Error 2

For details or bug reports, check the complete log file in:
/root/robotpkg/wip/dynamic-graph-v3/work/build.log
make: *** [/root/robotpkg/mk/build/build.mk:199: do-build] Error 2
make: *** [/root/robotpkg/mk/internal/trusted.mk:36: install] Error 2
Cleaning up file based variables
ERROR: Job failed: exit code 1
failed
robotpkg-dynamic-graph-v3-buster Test
| make[1]: Leaving directory '/root/robotpkg/wip/dynamic-graph-v3/work/dynamic-graph-4.4.0'
| make[1]: *** [CMakeFiles/Makefile2:583: src/CMakeFiles/dynamic-graph.dir/all] Error 2
| make: *** [Makefile:144: all] Error 2

For details or bug reports, check the complete log file in:
/root/robotpkg/wip/dynamic-graph-v3/work/build.log
make: *** [/root/robotpkg/mk/build/build.mk:199: do-build] Error 2
make: *** [/root/robotpkg/mk/internal/trusted.mk:36: install] Error 2
Cleaning up file based variables
ERROR: Job failed: exit code 1
failed
format Test
 #include <boost/test/output_test_stream.hpp>
+#include <boost/test/unit_test.hpp>

using boost::test_tools::output_test_stream;

++ git diff --ignore-submodules
++ wc -l
+ exit 1495
Cleaning up file based variables
ERROR: Job failed: exit code 1