Add test to follow multi-threading.

6 jobs for v3.6.0 in 2 minutes and 23 seconds (queued for 1 second)
latest
Status Name Job ID Coverage
  Test
failed doc-coverage #85270

00:00:41

0.0%
failed format #85271
allowed to fail

00:01:25

passed robotpkg-dynamic-graph-v3-16.04-debug #85267

00:02:13

passed robotpkg-dynamic-graph-v3-16.04-release #85266

00:02:23

failed robotpkg-dynamic-graph-v3-18.04-debug #85269

00:00:38

failed robotpkg-dynamic-graph-v3-18.04-release #85268

00:00:47

 
Name Stage Failure
failed
format Test
     output_test_stream output;
output << value;
- BOOST_CHECK (output.is_equal ("Type=string, value=value #2"));
+ BOOST_CHECK(output.is_equal("Type=string, value=value #2"));
}
}
Running after_script
Uploading artifacts for failed job
ERROR: Job failed: exit code 1
failed
robotpkg-dynamic-graph-v3-18.04-debug Test
| Makefile:143: recipe for target 'all' failed
For details or bug reports, check the complete log file in:
/root/robotpkg/wip/dynamic-graph-v3/work.runner-swwlejyc-project-166-concurrent-6/build.log

/root/robotpkg/mk/build/build.mk:198: recipe for target 'do-build' failed
make: *** [do-build] Error 2
/root/robotpkg/mk/internal/trusted.mk:36: recipe for target 'install' failed
make: *** [install] Error 2
ERROR: Job failed: exit code 1
failed
robotpkg-dynamic-graph-v3-18.04-release Test
For details or bug reports, check the complete log file in:
/root/robotpkg/wip/dynamic-graph-v3/work.runner-qtz7nxce-project-166-concurrent-3/build.log
make: *** [do-build] Error 2
/root/robotpkg/mk/build/build.mk:198: recipe for target 'do-build' failed
make: *** [install] Error 2
/root/robotpkg/mk/internal/trusted.mk:36: recipe for target 'install' failed
Running after_script
Uploading artifacts for failed job
ERROR: Job failed: exit code 1
failed
doc-coverage Test
src/exception/exception-abstract.cpp          31       0     0%   10,13-16,20,22,26,28,32,34,38,40-41,44,46-50,53,55,58,60,62,64,70,73-74,82,85
src/exception/exception-factory.cpp 13 0 0% 21,23,25-26,28,32,34-35,38,40,42,47,49
src/exception/exception-signal.cpp 12 0 0% 20,22,24-25,29,31-32,35,37,39,41,43
src/exception/exception-traces.cpp 12 0 0% 20,22,24-25,29,31-32,35,37,39,41,43
------------------------------------------------------------------------------
TOTAL 488 0 0%
------------------------------------------------------------------------------
$ gcovr -r . --html --html-details -o ${CI_PROJECT_DIR}/coverage/index.html
ERROR: Job failed: exit code 1