[loader] SDF support

9 jobs for pr/101 in 2 minutes and 36 seconds (queued for 2 seconds)
Status Name Job ID Coverage
  Test
failed doc-coverage #123827

00:00:36

passed format #123828

00:00:07

passed robotpkg-example-robot-data-18.04-release #123820

00:01:20

failed robotpkg-py-example-robot-data-py2-18.04-release #123821
allowed to fail

00:01:47

failed robotpkg-py-example-robot-data-py3-18.04-release #123822

00:02:23

failed robotpkg-py-example-robot-data-py3-20.04-release #123823

00:01:44

failed robotpkg-py-example-robot-data-py3-buster-release #123824

00:00:35

failed robotpkg-py-example-robot-data-py3-ferrum-release #123825
allowed to fail

00:02:35

failed robotpkg-py-example-robot-data-py3-stretch-release #123826

00:00:54

 
Name Stage Failure
failed
robotpkg-py-example-robot-data-py3-ferrum-release Test
Total Test time (real) =  20.85 sec

The following tests FAILED:
1 - py-load (Failed)
Errors while running CTest
Makefile:128: recipe for target 'test' failed
make: *** [test] Error 8
Cleaning up file based variables
ERROR: Job failed: exit code 1
failed
doc-coverage Test
------------------------------------------------------------------------------
File Lines Exec Cover Missing
------------------------------------------------------------------------------
------------------------------------------------------------------------------
TOTAL 0 0 --%
------------------------------------------------------------------------------
$ gcovr -e CMakeFiles -r . --html --html-details -o ${CI_PROJECT_DIR}/coverage/index.html
Cleaning up file based variables
ERROR: Job failed: exit code 1
failed
robotpkg-py-example-robot-data-py2-18.04-release Test
Total Test time (real) =  21.44 sec

The following tests FAILED:
1 - py-load (Failed)
Errors while running CTest
Makefile:109: recipe for target 'test' failed
make: *** [test] Error 8
Cleaning up file based variables
ERROR: Job failed: exit code 1
failed
robotpkg-py-example-robot-data-py3-20.04-release Test

Total Test time (real) = 18.53 sec

The following tests FAILED:
1 - py-load (Failed)
Errors while running CTest
make: *** [Makefile:110: test] Error 8
Cleaning up file based variables
ERROR: Job failed: exit code 1
failed
robotpkg-py-example-robot-data-py3-stretch-release Test
Total Test time (real) =  23.38 sec

The following tests FAILED:
1 - py-load (Failed)
Errors while running CTest
Makefile:74: recipe for target 'test' failed
make: *** [test] Error 8
Cleaning up file based variables
ERROR: Job failed: exit code 1
failed
robotpkg-py-example-robot-data-py3-buster-release Test

Total Test time (real) = 17.94 sec

The following tests FAILED:
1 - py-load (Failed)
Errors while running CTest
make: *** [Makefile:110: test] Error 8
Cleaning up file based variables
ERROR: Job failed: exit code 1
failed
robotpkg-py-example-robot-data-py3-18.04-release Test
Total Test time (real) =  23.65 sec

The following tests FAILED:
1 - py-load (Failed)
Errors while running CTest
Makefile:109: recipe for target 'test' failed
make: *** [test] Error 8
Cleaning up file based variables
ERROR: Job failed: exit code 1