[loadCassie] only load for pinocchio>=2.9.2

9 jobs for pr/100 in 1 minute and 20 seconds (queued for 1 second)
Status Name Job ID Coverage
  Test
failed doc-coverage #123797

00:00:22

failed format #123798

00:00:26

passed robotpkg-example-robot-data-18.04-release #123790

00:00:12

failed robotpkg-py-example-robot-data-py2-18.04-release #123791
allowed to fail

00:00:56

failed robotpkg-py-example-robot-data-py3-18.04-release #123792

00:00:56

passed robotpkg-py-example-robot-data-py3-20.04-release #123793

00:01:19

failed robotpkg-py-example-robot-data-py3-buster-release #123794

00:00:32

failed robotpkg-py-example-robot-data-py3-ferrum-release #123795
allowed to fail

00:00:26

failed robotpkg-py-example-robot-data-py3-stretch-release #123796

00:00:19

 
Name Stage Failure
failed
robotpkg-py-example-robot-data-py3-stretch-release Test
Total Test time (real) =   0.18 sec

The following tests FAILED:
1 - py-load (Failed)
Errors while running CTest
Makefile:74: recipe for target 'test' failed
make: *** [test] Error 8
Cleaning up file based variables
ERROR: Job failed: exit code 1
failed
doc-coverage Test
------------------------------------------------------------------------------
File Lines Exec Cover Missing
------------------------------------------------------------------------------
------------------------------------------------------------------------------
TOTAL 0 0 --%
------------------------------------------------------------------------------
$ gcovr -e CMakeFiles -r . --html --html-details -o ${CI_PROJECT_DIR}/coverage/index.html
Cleaning up file based variables
ERROR: Job failed: exit code 1
failed
format Test
./python/example_robot_data/robots_loader.py:257:44: E702 multiple statements on one line (semicolon)
./python/example_robot_data/robots_loader.py:257:62: E703 statement ends with a semicolon
./python/example_robot_data/robots_loader.py:258:24: E702 multiple statements on one line (semicolon)
./python/example_robot_data/robots_loader.py:260:1: W293 blank line contains whitespace
./python/example_robot_data/robots_loader.py:281:1: E302 expected 2 blank lines, found 1
./python/example_robot_data/robots_loader.py:286:1: E302 expected 2 blank lines, found 1
./python/example_robot_data/robots_loader.py:579:21: E225 missing whitespace around operator
Cleaning up file based variables
ERROR: Job failed: exit code 1
failed
robotpkg-py-example-robot-data-py3-buster-release Test

Total Test time (real) = 0.35 sec

The following tests FAILED:
1 - py-load (Failed)
Errors while running CTest
make: *** [Makefile:110: test] Error 8
Cleaning up file based variables
ERROR: Job failed: exit code 1
failed
robotpkg-py-example-robot-data-py2-18.04-release Test
Total Test time (real) =   0.09 sec

The following tests FAILED:
1 - py-load (Failed)
Errors while running CTest
Makefile:109: recipe for target 'test' failed
make: *** [test] Error 8
Cleaning up file based variables
ERROR: Job failed: exit code 1
failed
robotpkg-py-example-robot-data-py3-18.04-release Test
Total Test time (real) =   0.13 sec

The following tests FAILED:
1 - py-load (Failed)
Errors while running CTest
make: *** [test] Error 8
Makefile:109: recipe for target 'test' failed
Cleaning up file based variables
ERROR: Job failed: exit code 1
failed
robotpkg-py-example-robot-data-py3-ferrum-release Test
Total Test time (real) =   0.18 sec

The following tests FAILED:
1 - py-load (Failed)
Errors while running CTest
make: *** [test] Error 8
Makefile:128: recipe for target 'test' failed
Cleaning up file based variables
ERROR: Job failed: exit code 1