Bolt: Fix URDF path

9 jobs for pr/94 in 50 seconds (queued for 2 seconds)
Status Name Job ID Coverage
  Test
failed doc-coverage #121505

00:00:39

passed format #121506

00:00:49

passed robotpkg-example-robot-data-18.04-release #121498

00:00:13

failed robotpkg-py-example-robot-data-py2-18.04-release #121499

00:00:39

failed robotpkg-py-example-robot-data-py3-18.04-release #121500

00:00:42

failed robotpkg-py-example-robot-data-py3-20.04-release #121501

00:00:37

failed robotpkg-py-example-robot-data-py3-buster-release #121502

00:00:41

failed robotpkg-py-example-robot-data-py3-ferrum-release #121503

00:00:44

failed robotpkg-py-example-robot-data-py3-stretch-release #121504

00:00:45

 
Name Stage Failure
failed
robotpkg-py-example-robot-data-py3-ferrum-release Test
Total Test time (real) =  21.31 sec

The following tests FAILED:
1 - py-load (Failed)
Errors while running CTest
Makefile:128: recipe for target 'test' failed
make: *** [test] Error 8
Cleaning up file based variables
ERROR: Job failed: exit code 1
failed
robotpkg-py-example-robot-data-py2-18.04-release Test
Total Test time (real) =  21.21 sec

The following tests FAILED:
1 - py-load (Failed)
Errors while running CTest
make: *** [test] Error 8
Makefile:109: recipe for target 'test' failed
Cleaning up file based variables
ERROR: Job failed: exit code 1
failed
robotpkg-py-example-robot-data-py3-20.04-release Test

Total Test time (real) = 18.13 sec

The following tests FAILED:
1 - py-load (Failed)
Errors while running CTest
make: *** [Makefile:110: test] Error 8
Cleaning up file based variables
ERROR: Job failed: exit code 1
failed
robotpkg-py-example-robot-data-py3-buster-release Test

Total Test time (real) = 20.26 sec

The following tests FAILED:
1 - py-load (Failed)
Errors while running CTest
make: *** [Makefile:110: test] Error 8
Cleaning up file based variables
ERROR: Job failed: exit code 1
failed
doc-coverage Test
------------------------------------------------------------------------------
File Lines Exec Cover Missing
------------------------------------------------------------------------------
------------------------------------------------------------------------------
TOTAL 0 0 --%
------------------------------------------------------------------------------
$ gcovr -e CMakeFiles -r . --html --html-details -o ${CI_PROJECT_DIR}/coverage/index.html
Cleaning up file based variables
ERROR: Job failed: exit code 1
failed
robotpkg-py-example-robot-data-py3-18.04-release Test
Total Test time (real) =  21.13 sec

The following tests FAILED:
1 - py-load (Failed)
Errors while running CTest
Makefile:109: recipe for target 'test' failed
make: *** [test] Error 8
Cleaning up file based variables
ERROR: Job failed: exit code 1
failed
robotpkg-py-example-robot-data-py3-stretch-release Test
Total Test time (real) =  21.61 sec

The following tests FAILED:
1 - py-load (Failed)
Errors while running CTest
make: *** [test] Error 8
Makefile:74: recipe for target 'test' failed
Cleaning up file based variables
ERROR: Job failed: exit code 1