Rename "Solo" to "Solo8". Fixes #92

9 jobs for pr/93 in 1 minute and 57 seconds (queued for 2 seconds)
Status Name Job ID Coverage
  Test
failed doc-coverage #121317

00:00:21

failed format #121318

00:00:22

passed robotpkg-example-robot-data-18.04-release #121310

00:01:22

failed robotpkg-py-example-robot-data-py2-18.04-release #121311

00:01:22

failed robotpkg-py-example-robot-data-py3-18.04-release #121312

00:01:56

failed robotpkg-py-example-robot-data-py3-20.04-release #121313

00:01:29

failed robotpkg-py-example-robot-data-py3-buster-release #121314

00:01:29

failed robotpkg-py-example-robot-data-py3-ferrum-release #121315

00:01:28

failed robotpkg-py-example-robot-data-py3-stretch-release #121316

00:00:29

 
Name Stage Failure
failed
format Test
Using docker image sha256:7d18877096946a27a7f5384ab15194ad10b7a65f52809f4540553d06bb59e1a1 for gepetto/linters with digest gepetto/linters@sha256:58da1c4fe2b1dfd36043b3f5c01feef424b8188f1bb33e4f56926e85b17a6e03 ...
$ test -f /builds/setup.cfg || ln -s /root/setup.cfg /builds
$ test -f /builds/.clang-format || ln -s /root/.clang-format /builds
$ check-clang-format.sh
error: cannot use -i when reading from stdin.
$ flake8 .
./python/example_robot_data/robots_loader.py:501:13: F821 undefined name 'SoloLoader'
Cleaning up file based variables
ERROR: Job failed: exit code 1
failed
robotpkg-py-example-robot-data-py3-ferrum-release Test
0% tests passed, 1 tests failed out of 1

Total Test time (real) = 4.75 sec

The following tests FAILED:
1 - py-load (Failed)
Makefile:128: recipe for target 'test' failed
Cleaning up file based variables
ERROR: Job failed: exit code 1
failed
robotpkg-py-example-robot-data-py2-18.04-release Test
Total Test time (real) =   0.17 sec

The following tests FAILED:
1 - py-load (Failed)
Errors while running CTest
make: *** [test] Error 8
Makefile:109: recipe for target 'test' failed
Cleaning up file based variables
ERROR: Job failed: exit code 1
failed
robotpkg-py-example-robot-data-py3-18.04-release Test
Total Test time (real) =   0.18 sec

The following tests FAILED:
1 - py-load (Failed)
Errors while running CTest
make: *** [test] Error 8
Makefile:109: recipe for target 'test' failed
Cleaning up file based variables
ERROR: Job failed: exit code 1
failed
robotpkg-py-example-robot-data-py3-buster-release Test

0% tests passed, 1 tests failed out of 1

Total Test time (real) = 3.47 sec

The following tests FAILED:
1 - py-load (Failed)
Cleaning up file based variables
ERROR: Job failed: exit code 1
failed
robotpkg-py-example-robot-data-py3-20.04-release Test

Total Test time (real) = 0.27 sec

The following tests FAILED:
1 - py-load (Failed)
Errors while running CTest
make: *** [Makefile:110: test] Error 8
Cleaning up file based variables
ERROR: Job failed: exit code 1
failed
robotpkg-py-example-robot-data-py3-stretch-release Test
Total Test time (real) =   0.20 sec

The following tests FAILED:
1 - py-load (Failed)
Errors while running CTest
make: *** [test] Error 8
Makefile:74: recipe for target 'test' failed
Cleaning up file based variables
ERROR: Job failed: exit code 1
failed
doc-coverage Test
------------------------------------------------------------------------------
File Lines Exec Cover Missing
------------------------------------------------------------------------------
------------------------------------------------------------------------------
TOTAL 0 0 --%
------------------------------------------------------------------------------
$ gcovr -e CMakeFiles -r . --html --html-details -o ${CI_PROJECT_DIR}/coverage/index.html
Cleaning up file based variables
ERROR: Job failed: exit code 1