[reduced] Added effort limits for reduced models

20 jobs for topic/talos-limits in 3 minutes and 23 seconds (queued for 2 seconds)
Status Name Job ID Coverage
  Test
failed doc-coverage #54942

00:03:17

passed format #54943

00:00:18

passed robotpkg-example-robot-data-16.04-debug #54924

00:03:00

passed robotpkg-example-robot-data-16.04-release #54925

00:00:34

passed robotpkg-example-robot-data-18.04-debug #54927

00:00:34

passed robotpkg-example-robot-data-18.04-release #54926

00:03:23

passed robotpkg-example-robot-data-stretch-debug #54929

00:03:21

passed robotpkg-example-robot-data-stretch-release #54928

00:00:34

failed robotpkg-py-example-robot-data-16.04-debug #54931

00:00:35

failed robotpkg-py-example-robot-data-16.04-release #54930

00:02:12

failed robotpkg-py-example-robot-data-18.04-debug #54935

00:02:13

failed robotpkg-py-example-robot-data-18.04-release #54934

00:03:14

failed robotpkg-py-example-robot-data-py3-16.04-debug #54933
allowed to fail

00:00:24

failed robotpkg-py-example-robot-data-py3-16.04-release #54932
allowed to fail

00:02:14

failed robotpkg-py-example-robot-data-py3-18.04-debug #54937
allowed to fail

00:00:19

failed robotpkg-py-example-robot-data-py3-18.04-release #54936
allowed to fail

00:03:10

failed robotpkg-py-example-robot-data-py3-stretch-debug #54941
allowed to fail

00:02:09

failed robotpkg-py-example-robot-data-py3-stretch-release #54940
allowed to fail

00:00:19

failed robotpkg-py-example-robot-data-stretch-debug #54939

00:03:09

failed robotpkg-py-example-robot-data-stretch-release #54938

00:02:10

 
Name Stage Failure
failed
robotpkg-py-example-robot-data-py3-18.04-release Test
ERROR: you can configure robotpkg.conf to use this version instead.
ERROR:
ERROR: See /root/robotpkg/wip/py-example-robot-data/work.runner-tRjAffv3-project-350-concurrent-4/sysdep.log for details.
ERROR: ======================================================================
make: *** [do-depends] Error 1
/root/robotpkg/mk/depends/depends.mk:70: recipe for target 'do-depends' failed
/root/robotpkg/mk/internal/trusted.mk:36: recipe for target 'install' failed
make: *** [install] Error 2
ERROR: Job failed: exit code 1
failed
robotpkg-py-example-robot-data-stretch-release Test
ERROR: missing:	/opt/openrobots/include/example-robot-data/config.hh
ERROR:
ERROR: Please reinstall the package in ../../wip/example-robot-data
ERROR: ======================================================================
make: *** [do-depends] Error 1
/root/robotpkg/mk/depends/depends.mk:70: recipe for target 'do-depends' failed
make: *** [install] Error 2
/root/robotpkg/mk/internal/trusted.mk:36: recipe for target 'install' failed
ERROR: Job failed: exit code 1
failed
doc-coverage Test
/root/robotpkg/mk/depends/depends.mk:70: recipe for target 'do-depends' failed
make: *** [install] Error 2
/root/robotpkg/mk/internal/trusted.mk:36: recipe for target 'install' failed
Running after script...
$ cd /root/robotpkg/wip/py-example-robot-data
$ build=$(make show-var VARNAME=CONFIGURE_DIRS); cd $(make show-var VARNAME=WRKSRC); cd $build
$ make doc
make: *** No rule to make target 'doc'. Stop.
ERROR: Job failed: exit code 1
failed
robotpkg-py-example-robot-data-18.04-release Test
ERROR: you can configure robotpkg.conf to use this version instead.
ERROR:
ERROR: See /root/robotpkg/wip/py-example-robot-data/work.runner-tRjAffv3-project-350-concurrent-3/sysdep.log for details.
ERROR: ======================================================================
/root/robotpkg/mk/depends/depends.mk:70: recipe for target 'do-depends' failed
make: *** [do-depends] Error 1
/root/robotpkg/mk/internal/trusted.mk:36: recipe for target 'install' failed
make: *** [install] Error 2
ERROR: Job failed: exit code 1
failed
robotpkg-py-example-robot-data-stretch-debug Test
ERROR: missing:	/opt/openrobots/include/example-robot-data/config.hh
ERROR:
ERROR: Please reinstall the package in ../../wip/example-robot-data
ERROR: ======================================================================
/root/robotpkg/mk/depends/depends.mk:70: recipe for target 'do-depends' failed
make: *** [do-depends] Error 1
/root/robotpkg/mk/internal/trusted.mk:36: recipe for target 'install' failed
make: *** [install] Error 2
ERROR: Job failed: exit code 1
failed
robotpkg-py-example-robot-data-py3-16.04-release Test
ERROR: missing:	/opt/openrobots/include/example-robot-data/config.hh
ERROR:
ERROR: Please reinstall the package in ../../wip/example-robot-data
ERROR: ======================================================================
/root/robotpkg/mk/depends/depends.mk:70: recipe for target 'do-depends' failed
make: *** [do-depends] Error 1
make: *** [install] Error 2
/root/robotpkg/mk/internal/trusted.mk:36: recipe for target 'install' failed
ERROR: Job failed: exit code 1
failed
robotpkg-py-example-robot-data-18.04-debug Test
ERROR: you can configure robotpkg.conf to use this version instead.
ERROR:
ERROR: See /root/robotpkg/wip/py-example-robot-data/work.runner-7gqkM7SY-project-350-concurrent-2/sysdep.log for details.
ERROR: ======================================================================
make: *** [do-depends] Error 1
/root/robotpkg/mk/depends/depends.mk:70: recipe for target 'do-depends' failed
make: *** [install] Error 2
/root/robotpkg/mk/internal/trusted.mk:36: recipe for target 'install' failed
ERROR: Job failed: exit code 1
failed
robotpkg-py-example-robot-data-16.04-release Test
ERROR: missing:	/opt/openrobots/include/example-robot-data/config.hh
ERROR:
ERROR: Please reinstall the package in ../../wip/example-robot-data
ERROR: ======================================================================
/root/robotpkg/mk/depends/depends.mk:70: recipe for target 'do-depends' failed
make: *** [do-depends] Error 1
/root/robotpkg/mk/internal/trusted.mk:36: recipe for target 'install' failed
make: *** [install] Error 2
ERROR: Job failed: exit code 1
failed
robotpkg-py-example-robot-data-py3-stretch-debug Test
ERROR: you can configure robotpkg.conf to use this version instead.
ERROR:
ERROR: See /root/robotpkg/wip/py-example-robot-data/work.runner-7gqkM7SY-project-350-concurrent-4/sysdep.log for details.
ERROR: ======================================================================
/root/robotpkg/mk/depends/depends.mk:70: recipe for target 'do-depends' failed
make: *** [do-depends] Error 1
/root/robotpkg/mk/internal/trusted.mk:36: recipe for target 'install' failed
make: *** [install] Error 2
ERROR: Job failed: exit code 1
failed
robotpkg-py-example-robot-data-16.04-debug Test
ERROR: missing:	/opt/openrobots/include/example-robot-data/config.hh
ERROR:
ERROR: Please reinstall the package in ../../wip/example-robot-data
ERROR: ======================================================================
/root/robotpkg/mk/depends/depends.mk:70: recipe for target 'do-depends' failed
make: *** [do-depends] Error 1
/root/robotpkg/mk/internal/trusted.mk:36: recipe for target 'install' failed
make: *** [install] Error 2
ERROR: Job failed: exit code 1
failed
robotpkg-py-example-robot-data-py3-16.04-debug Test
ERROR: missing:	/opt/openrobots/include/example-robot-data/config.hh
ERROR:
ERROR: Please reinstall the package in ../../wip/example-robot-data
ERROR: ======================================================================
make: *** [do-depends] Error 1
/root/robotpkg/mk/depends/depends.mk:70: recipe for target 'do-depends' failed
/root/robotpkg/mk/internal/trusted.mk:36: recipe for target 'install' failed
make: *** [install] Error 2
ERROR: Job failed: exit code 1
failed
robotpkg-py-example-robot-data-py3-stretch-release Test
ERROR: you can configure robotpkg.conf to use this version instead.
ERROR:
ERROR: See /root/robotpkg/wip/py-example-robot-data/work.runner-ULfN9w-c-project-350-concurrent-2/sysdep.log for details.
ERROR: ======================================================================
make: *** [do-depends] Error 1
/root/robotpkg/mk/depends/depends.mk:70: recipe for target 'do-depends' failed
/root/robotpkg/mk/internal/trusted.mk:36: recipe for target 'install' failed
make: *** [install] Error 2
ERROR: Job failed: exit code 1
failed
robotpkg-py-example-robot-data-py3-18.04-debug Test
ERROR: you can configure robotpkg.conf to use this version instead.
ERROR:
ERROR: See /root/robotpkg/wip/py-example-robot-data/work.runner-ULfN9w-c-project-350-concurrent-1/sysdep.log for details.
ERROR: ======================================================================
/root/robotpkg/mk/depends/depends.mk:70: recipe for target 'do-depends' failed
make: *** [do-depends] Error 1
/root/robotpkg/mk/internal/trusted.mk:36: recipe for target 'install' failed
make: *** [install] Error 2
ERROR: Job failed: exit code 1