Release v3.1.1

32 jobs for master in 10 minutes and 24 seconds (queued for 2 seconds)
latest
Name Stage Failure
failed
robotpkg-py-example-robot-data-18.04-release Test There has been a runner system failure, please try again
No job log
failed
robotpkg-py-example-robot-data-18.04-debug Test
ERROR: missing:	/opt/openrobots/include/example-robot-data/config.hh
ERROR:
ERROR: Please reinstall the package in ../../wip/example-robot-data
ERROR: ======================================================================
make: *** [do-depends] Error 1
/root/robotpkg/mk/depends/depends.mk:70: recipe for target 'do-depends' failed
make: *** [install] Error 2
/root/robotpkg/mk/internal/trusted.mk:36: recipe for target 'install' failed
ERROR: Job failed: exit code 1
failed
robotpkg-py-example-robot-data-py3-16.04-debug Test
ERROR: missing:	/opt/openrobots/include/example-robot-data/config.hh
ERROR:
ERROR: Please reinstall the package in ../../wip/example-robot-data
ERROR: ======================================================================
/root/robotpkg/mk/depends/depends.mk:70: recipe for target 'do-depends' failed
make: *** [do-depends] Error 1
/root/robotpkg/mk/internal/trusted.mk:36: recipe for target 'install' failed
make: *** [install] Error 2
ERROR: Job failed: exit code 1
failed
robotpkg-py-example-robot-data-py3-18.04-release Test
ERROR: missing:	/opt/openrobots/include/example-robot-data/config.hh
ERROR:
ERROR: Please reinstall the package in ../../wip/example-robot-data
ERROR: ======================================================================
/root/robotpkg/mk/depends/depends.mk:70: recipe for target 'do-depends' failed
make: *** [do-depends] Error 1
make: *** [install] Error 2
/root/robotpkg/mk/internal/trusted.mk:36: recipe for target 'install' failed
ERROR: Job failed: exit code 1
failed
robotpkg-py-example-robot-data-py3-16.04-release Test
ERROR: missing:	/opt/openrobots/include/example-robot-data/config.hh
ERROR:
ERROR: Please reinstall the package in ../../wip/example-robot-data
ERROR: ======================================================================
make: *** [do-depends] Error 1
/root/robotpkg/mk/depends/depends.mk:70: recipe for target 'do-depends' failed
/root/robotpkg/mk/internal/trusted.mk:36: recipe for target 'install' failed
make: *** [install] Error 2
ERROR: Job failed: exit code 1
failed
doc-coverage Test There has been a runner system failure, please try again
No job log
failed
robotpkg-py-example-robot-data-stretch-debug Test
ERROR: missing:	/opt/openrobots/include/example-robot-data/config.hh
ERROR:
ERROR: Please reinstall the package in ../../wip/example-robot-data
ERROR: ======================================================================
/root/robotpkg/mk/depends/depends.mk:70: recipe for target 'do-depends' failed
make: *** [do-depends] Error 1
make: *** [install] Error 2
/root/robotpkg/mk/internal/trusted.mk:36: recipe for target 'install' failed
ERROR: Job failed: exit code 1
failed
robotpkg-py-example-robot-data-16.04-release Test
ERROR: missing:	/opt/openrobots/include/example-robot-data/config.hh
ERROR:
ERROR: Please reinstall the package in ../../wip/example-robot-data
ERROR: ======================================================================
make: *** [do-depends] Error 1
/root/robotpkg/mk/depends/depends.mk:70: recipe for target 'do-depends' failed
make: *** [install] Error 2
/root/robotpkg/mk/internal/trusted.mk:36: recipe for target 'install' failed
ERROR: Job failed: exit code 1
failed
robotpkg-py-example-robot-data-py3-stretch-release Test
ERROR: missing:	/opt/openrobots/include/example-robot-data/config.hh
ERROR:
ERROR: Please reinstall the package in ../../wip/example-robot-data
ERROR: ======================================================================
/root/robotpkg/mk/depends/depends.mk:70: recipe for target 'do-depends' failed
make: *** [do-depends] Error 1
make: *** [install] Error 2
/root/robotpkg/mk/internal/trusted.mk:36: recipe for target 'install' failed
ERROR: Job failed: exit code 1
failed
robotpkg-py-example-robot-data-16.04-debug Test
ERROR: missing:	/opt/openrobots/include/example-robot-data/config.hh
ERROR:
ERROR: Please reinstall the package in ../../wip/example-robot-data
ERROR: ======================================================================
make: *** [do-depends] Error 1
/root/robotpkg/mk/depends/depends.mk:70: recipe for target 'do-depends' failed
make: *** [install] Error 2
/root/robotpkg/mk/internal/trusted.mk:36: recipe for target 'install' failed
ERROR: Job failed: exit code 1
failed
robotpkg-py-example-robot-data-py3-18.04-debug Test
ERROR: missing:	/opt/openrobots/include/example-robot-data/config.hh
ERROR:
ERROR: Please reinstall the package in ../../wip/example-robot-data
ERROR: ======================================================================
make: *** [do-depends] Error 1
/root/robotpkg/mk/depends/depends.mk:70: recipe for target 'do-depends' failed
make: *** [install] Error 2
/root/robotpkg/mk/internal/trusted.mk:36: recipe for target 'install' failed
ERROR: Job failed: exit code 1
failed
robotpkg-py-example-robot-data-py3-stretch-debug Test
ERROR: missing:	/opt/openrobots/include/example-robot-data/config.hh
ERROR:
ERROR: Please reinstall the package in ../../wip/example-robot-data
ERROR: ======================================================================
make: *** [do-depends] Error 1
/root/robotpkg/mk/depends/depends.mk:70: recipe for target 'do-depends' failed
/root/robotpkg/mk/internal/trusted.mk:36: recipe for target 'install' failed
make: *** [install] Error 2
ERROR: Job failed: exit code 1
failed
robotpkg-py-example-robot-data-stretch-release Test
ERROR: missing:	/opt/openrobots/include/example-robot-data/config.hh
ERROR:
ERROR: Please reinstall the package in ../../wip/example-robot-data
ERROR: ======================================================================
make: *** [do-depends] Error 1
/root/robotpkg/mk/depends/depends.mk:70: recipe for target 'do-depends' failed
/root/robotpkg/mk/internal/trusted.mk:36: recipe for target 'install' failed
make: *** [install] Error 2
ERROR: Job failed: exit code 1